Contenu | Rechercher | Menus

Annonce

Si vous rencontrez des soucis à rester connecté sur le forum (ou si vous avez perdu votre mot de passe) déconnectez-vous et reconnectez-vous depuis cette page, en cochant la case "Me connecter automatiquement lors de mes prochaines visites".
nombre réponses : 25

#0 Re : -1 »  [Abandon] Ubuntu 12.04 /Dell Inspiron 1501 et multiples ennuis » Hier à 17:40

xanmoo
Réponses : 11

quelqu'un semble avoir résolu ce même problème http://ubuntuforums.org/showthread.php?t=2264496. il faut télécharger un pilote: http://ubuntuforums.org/attachment.php?attachmentid=229272&d=1356748832 et faire comme indiqué dans le forum,c'est à dire:

sudo mkdir /lib/firmware/b43
sudo cp Desktop/b43/* /lib/firmware/b43
sudo rmmod -f b43
sudo rmmod -f ssb
sudo modprobe b43

PS:
Pourquoi installer une vieille distribution?

#1 Re : -1 »  [Abandon] Ubuntu 12.04 /Dell Inspiron 1501 et multiples ennuis » Hier à 21:09

xanmoo
Réponses : 11

Je doute de pouvoir t'aider bcp plus loin. Concernant la 12.04 tu va avoir des logiciels anciens sans possibilité de mise à jour ... sur un ordinosaure, ne pouvant installer une ubuntu récente,j'ai opté pour une sparkylinux, qui est une fait une debian testing facile à installer...

#2 -1 »  Recupérer des données d'un disque usb externe "formaté" par erreur » Hier à 16:50

xanmoo
Réponses : 6

Bonjour,

J'ai écrit par erreur une image d'une distribution sur un disque externe d'1To (au  lieu d'une clée usb tongue !). Le disque devait être plein à moitié.
                  1 Je pense acheter un disque externe (transcend) de 2To (disque n°2)
                  2 puis faire une image du disque d'1To sur le disque n°2
                  3 pour ensuite essayer de récupérer (avec photorec) les fichiers à partir de l'image et recopier les fichier sur le disque n°2 ( sur lequel il reste 1To d'espace disponible).

Cette démarche est-elle correcte? En particulier l'image du disque et les fichiers peuvent-ils être sur le même disque, ou faut-il deux disque pour la récupération (disque source et un disque cible).
Est-il possible de récupérer en conservant les différents dossiers ou tout est en vrac?

merci.

#3 Re : -1 »  Recupérer des données d'un disque usb externe "formaté" par erreur » Hier à 17:23

xanmoo
Réponses : 6

A priori je ne risque pas de perdre des données en faisant  une image du disque incriminé, ce disque étant laissé de coté pendant la phase de récuprération.

Ma question est de savoir si je peux utiliser photorec par exemple sur une image enregistrée sur un unique disque de secours et sauver les fichiers sur ce même disque (2To) sur lequel il doit y avoir assez de place pour stocker l'image (1To) et les fichiers dont le volume fait moins d'1To.

Je pourrais éventuellement acheter deux disque de 1To, un contenant l'image du disque endommagé et un autre pour sauver les données. Cependant je pense que cette solution est plus chère et je ne suis pas sur que l'image d'un disque d'1Totienne sur un disque physique d'1To ...

#4 Re : -1 »  Recupérer des données d'un disque usb externe "formaté" par erreur » Hier à 19:08

xanmoo
Réponses : 6

Voici une copie du message que j'ai posté sur le site de l'auteur de testdisk et phorec, j'essai de préciser la marche à suivre:

Bonjour,

J'ai écrit par erreur une image d'une distribution sur un disque externe d'1To (au  lieu d'une clée usb tongue !).
Ce qui fait que mon disque se prend pour un disque d'installation d'une debian de 4Go avec une partition ext4  :oops:
https://goo.gl/photos/4ZnE5YPaZNABpiA76


Le disque devait être plein à moitié.
                1 Je pense acheter un disque externe (transcend) de 2To (disque n°2)

Si le disque est vendu avec une partition FAT, je suppose qu'il faudra le formater avec une partition capable de rececvoir des fichiers de grande taille de manière à pouvoir enregistrer dessus une image du disque endommagé

                  2 puis faire une image du disque d'1To sur le disque n°2 avec gddrescue plutot qu'avec dd: je ne suis pas certains de la syntaxe, faut'il faire:

ddrescue -r 5 -b 512 /dev/sdb /chemin/vers/le/disque_n°2/image_de_recup.iso

ou

dd if=/dev/sdb of=chemin/vers/le/disque_n°2/image_de_recup.iso bs=<taille des blocs> skip= seek= conv=<conversion>

Quelles valeurs choisir pour bs et seek si on utilise dd?

                  3 pour ensuite essayer de récupérer (avec photorec ou testdisk) les fichiers à partir de l'image et recopier les fichier sur le disque n°2 ( sur lequel il reste 1To d'espace disponible).

depuis le disque n°2 faire
testdisk image_de_recup.iso

Cette démarche est-elle correcte? En particulier l'image du disque et les fichiers peuvent-ils être sur le même disque, ou faut-il deux disque pour la récupération (disque source et un disque cible).
Est-il possible de récupérer en conservant les différents dossiers ou tout est en vrac? D'apès ce que j'ai put lire, pour espérer garder les dossiers il faut utiliser testdisk.

merci.

#5 Re : -1 »  Dossier mystérieusement disparu puis... » Hier à 17:13

xanmoo
Réponses : 1

disque en mauvaise santé?

#6 Re : -1 »  automatisation Image tiff » Le 26/08/2015, à 16:09

xanmoo
Réponses : 5

python + numpy + scikit-image ou mahotas.

l'idée:
1 recherche de maxima regionaux
2 étiquetage (labelling)
3 la valeur max du label donne le nombre de blobs

#7 Re : -1 »  automatisation Image tiff » Le 26/08/2015, à 16:54

xanmoo
Réponses : 5

En python avec mahotas, on peut trouver 284 blobs (traces?) cela donne par exemple:
812180segmentation.png

# -*- coding: utf-8 -*-
"""
Created on Wed Aug 26 16:36:38 2015

@author: jeanpat
"""

import numpy as np
import mahotas as mh
from matplotlib import pyplot as plt
im = mh.imread('285243T65743.png')
gauss = mh.gaussian_filter(im, 9)

## let's use regional minima black blobs
remax = mh.regmin(gauss, Bc=mh.disk(9))
dil = mh.dilate(remax,Bc=mh.disk(3))
lab,n = mh.labeled.label(remax)
display = mh.overlay(im, red= dil)
print n

plt.imshow(display)
plt.show()

#8 -1 »  config ipython notebook (jupyter) en vrac » Le 26/08/2015, à 16:28

xanmoo
Réponses : 0

Bonjour à tous,

à la suite d'une mise à jour (sudo pip install -U ipython[all]), mon environnement ipython notebook est mort. Ce la se manifeste ainsi:
on peut démarrer un notebook ipython (jupyter) depuis un terminal ainsi:

$ jupyter notebook
[I 16:15:44.792 NotebookApp] Serving notebooks from local directory: /home/jeanpat
[I 16:15:44.792 NotebookApp] 0 active kernels 
[I 16:15:44.792 NotebookApp] The IPython Notebook is running at: http://localhost:8888/
[I 16:15:44.792 NotebookApp] Use Control-C to stop this server and shut down all kernels (twice to skip confirmation).

(process:11705): GLib-CRITICAL **: g_slice_set_config: assertion 'sys_page_size == 0' failed
[I 16:15:50.325 NotebookApp] Kernel started: 50c937a7-9ab6-456f-8e65-6d7de55301a6
[IPKernelApp] ERROR | No such comm target registered: ipython.widget

jusque là tout va bien, si je veux additionner 1+1 (+Shift+enter), il ne se passe rien, par contre si je démarrage ipython dans une console 1+1 donne bien 2.

Ipython notebook souffre de la même maladie dans un environnement virtuel faisant appel au modules installés dans /usr/local... Par ipython notebook fonctionne dans un environnement virtuel séparé du reste des lib du système. La seule solution que je vois est de réinstaller totalement ubuntu...pour retrouver un système sain.

il doit y avoir une lib installée localement qui coince (zmq?), merci pour vos conseils...

#9 -1 »  recup données sur disque 1To (Help) » Le 27/07/2015, à 17:56

xanmoo
Réponses : 3

Bonjour,

j'ai confondu une clé usb et un disque externe d'1To... et j'ai gravé sur le disque une iso (debian) avec image writer !!! est-il possible de reccupérer une partie du disque ou c'est mort?

#10 -1 »  Installer calibre 2.3.1 pour ubuntu 15.04 » Le 19/06/2015, à 13:43

xanmoo
Réponses : 2

Bonjour,

Je tente d'installer le logiciel de gestion de ebook calibre dans sa version 2.3.1 (2.20 dans le dépot) sur une ubuntu 15.04. Comme indiqué dans le site:

sudo -v && wget -nv -O- https://raw.githubusercontent.com/kovidgoyal/calibre/master/setup/linux-installer.py | sudo python -c "import sys; main=lambda:sys.stderr.write('Download failed\n'); exec(sys.stdin.read()); main()"

Problème quand on lance calibre depuis un terminal, calibre n'est pas détecté (pas dans le path). Calibre est installé dans

/opt/calibre

Depuis un terminal, on obtient également une erreur si on tape:

:/opt/calibre/bin$ ./calibre
./calibre: error while loading shared libraries: libcalibre-launcher.so: cannot open shared object file: No such file or directory

La modification de PATH ne résoud pas le problème:

:/opt/calibre/bin$ PATH=$PATH:/opt/calibre/bin; export PATH;
jeanpat@jeanpat-WA50SHQ:/opt/calibre/bin$ calibre
calibre: error while loading shared libraries: libcalibre-launcher.so: cannot open shared object file: No such file or directory

Si j'essaie d'ajouter le répertoire contenant les librairies *.so, ça ne marche pas:

jeanpat@jeanpat-WA50SHQ:/opt/calibre/bin$ PATH=$PATH:/opt/calibre/lib; export PATH;
jeanpat@jeanpat-WA50SHQ:/opt/calibre/bin$ calibre
calibre: error while loading shared libraries: libcalibre-launcher.so: cannot open shared object file: No such file or directory

Comment indiquer à calibre ou trouver ses lib qui se trouve dans /opt/calibre/lib ?

merci

#11 -1 »  [Résolu] Gros crash de Unity (ubuntu15.04) » Le 28/06/2015, à 15:59

xanmoo
Réponses : 1

Bonjour à tous,

La config de mon ordi (ubuntu 15.04) semble bien mal en point. Après sorti de la mise en veille, je constate que les appli que j'avais mis dans le lanceur ne sont plus là... Après redémarrage,même situation. Nautilus ne se lance plus depuis son icône. Depuis un terminal:

:~$ nautilus
GLib-GIO-Message: Using the 'memory' GSettings backend.  Your settings will not be saved or shared with other applications.
Erreur de segmentation (core dumped)

Impossible de remettre le son.

Même problème depuis la session invité

Argh!
Merci de votre aide

jean-pat

#12 Re : -1 »  [Résolu] Gros crash de Unity (ubuntu15.04) » Le 28/06/2015, à 16:13

xanmoo
Réponses : 1

Une petite recherche et je tombe sur: http://askubuntu.com/questions/558446/m … untu-reins.

Depuis un terminal, je fais donc:

ldd /usr/lib/x86_64-linux-gnu/gio/modules/libdconfsettings.so

et je vois des liens vers /opt/calibre . Un version installée à la main il y a quelque temps.

Solution

cd /opt:
sudo rm -rf calibre/

Redémarrage retour à la normale... bizarre

#13 Re : -1 »  [Résolu] ubuntu 15.04 » Le 27/04/2015, à 20:34

xanmoo
Réponses : 15

La mise à niveau de 14.10 à 15.04 s'est bien passée. des petits problèmes de gel de l'écran avec le pilote nvidia se sont résolu automagiquement. Quelques améliorations de unity vues sur omg ubuntu (tiroir dans le dash) rendent l'usage agréable. Par contre je trouve que le multi-moniteur reste folklorique ...

#14 -1 »  executer un fichier jnlp (Site PHET) » Le 15/02/2015, à 20:22

xanmoo
Réponses : 2

Bonjour,
Je suis sous 14.10 avec la version icetea  (Version 7 Update 75 selon Oracle). J'essaie d'écuter un programme du site PHETPHET simulation en physique et donc cela ne fonctionne puls (comme dans le temps). L'extension n'est associée à rien, impossible de lancer la simulation.

#15 Re : -1 »  executer un fichier jnlp (Site PHET) » Le 16/02/2015, à 18:45

xanmoo
Réponses : 2

Iced Tea Java WebStart ne fait pas parti des choix ...

openjdk 6 et 7 sont installés, après avoir installé la version openjdk 8, il est possible de lancer le fichier jar. Pour les fichier jnlp, seul firefox est proposé et cela ne fonctionne pas... à suivre.

#17 Re : -1 »  League of legends - erreur de connexion » Le 17/10/2014, à 19:19

xanmoo
Réponses : 14

La mise à jour vers POL 4.2.5 ne suffit pas

#18 Re : -1 »  League of legends - erreur de connexion » Le 17/10/2014, à 19:42

xanmoo
Réponses : 14

C'est réparé, depuis l'interface de POL > configurer > éditeur de la base de registres>

Puis je n'ai pas effacé la clée wininet, simplement renommée en OLDwininet

#19 -1 »  Compiler opencv3 alpha avec support cuda: opencl_kernels_core.hpp ? » Le 07/11/2014, à 12:08

xanmoo
Réponses : 6

Bonjour,
J'essaie de compiler opencv3 avec le support cuda et python en utilisant cmake-gui sur un i5+nvidia 740m
J'ai installer cuda 5.5 depuis les dépots et un tas de lib depuis synaptics.

La sortie de l'étape de configuration est:

The CXX compiler identification is GNU 4.8.2
The C compiler identification is GNU 4.8.2
Check for working CXX compiler: /usr/bin/c++
Check for working CXX compiler: /usr/bin/c++ -- works
Detecting CXX compiler ABI info
Detecting CXX compiler ABI info - done
Check for working C compiler: /usr/bin/cc
Check for working C compiler: /usr/bin/cc -- works
Detecting C compiler ABI info
Detecting C compiler ABI info - done
Detected version of GNU GCC: 48 (408)
Performing Test HAVE_CXX_FSIGNED_CHAR
Performing Test HAVE_CXX_FSIGNED_CHAR - Success
Performing Test HAVE_C_FSIGNED_CHAR
Performing Test HAVE_C_FSIGNED_CHAR - Success
Performing Test HAVE_CXX_W
Performing Test HAVE_CXX_W - Success
Performing Test HAVE_C_W
Performing Test HAVE_C_W - Success
Performing Test HAVE_CXX_WALL
Performing Test HAVE_CXX_WALL - Success
Performing Test HAVE_C_WALL
Performing Test HAVE_C_WALL - Success
Performing Test HAVE_CXX_WERROR_RETURN_TYPE
Performing Test HAVE_CXX_WERROR_RETURN_TYPE - Success
Performing Test HAVE_C_WERROR_RETURN_TYPE
Performing Test HAVE_C_WERROR_RETURN_TYPE - Success
Performing Test HAVE_CXX_WERROR_NON_VIRTUAL_DTOR
Performing Test HAVE_CXX_WERROR_NON_VIRTUAL_DTOR - Success
Performing Test HAVE_C_WERROR_NON_VIRTUAL_DTOR
Performing Test HAVE_C_WERROR_NON_VIRTUAL_DTOR - Success
Performing Test HAVE_CXX_WERROR_ADDRESS
Performing Test HAVE_CXX_WERROR_ADDRESS - Success
Performing Test HAVE_C_WERROR_ADDRESS
Performing Test HAVE_C_WERROR_ADDRESS - Success
Performing Test HAVE_CXX_WERROR_SEQUENCE_POINT
Performing Test HAVE_CXX_WERROR_SEQUENCE_POINT - Success
Performing Test HAVE_C_WERROR_SEQUENCE_POINT
Performing Test HAVE_C_WERROR_SEQUENCE_POINT - Success
Performing Test HAVE_CXX_WFORMAT
Performing Test HAVE_CXX_WFORMAT - Success
Performing Test HAVE_C_WFORMAT
Performing Test HAVE_C_WFORMAT - Success
Performing Test HAVE_CXX_WERROR_FORMAT_SECURITY
Performing Test HAVE_CXX_WERROR_FORMAT_SECURITY - Success
Performing Test HAVE_C_WERROR_FORMAT_SECURITY
Performing Test HAVE_C_WERROR_FORMAT_SECURITY - Success
Performing Test HAVE_CXX_WMISSING_DECLARATIONS
Performing Test HAVE_CXX_WMISSING_DECLARATIONS - Success
Performing Test HAVE_C_WMISSING_DECLARATIONS
Performing Test HAVE_C_WMISSING_DECLARATIONS - Success
Performing Test HAVE_CXX_WMISSING_PROTOTYPES
Performing Test HAVE_CXX_WMISSING_PROTOTYPES - Failed
Performing Test HAVE_C_WMISSING_PROTOTYPES
Performing Test HAVE_C_WMISSING_PROTOTYPES - Success
Performing Test HAVE_CXX_WSTRICT_PROTOTYPES
Performing Test HAVE_CXX_WSTRICT_PROTOTYPES - Failed
Performing Test HAVE_C_WSTRICT_PROTOTYPES
Performing Test HAVE_C_WSTRICT_PROTOTYPES - Success
Performing Test HAVE_CXX_WUNDEF
Performing Test HAVE_CXX_WUNDEF - Success
Performing Test HAVE_C_WUNDEF
Performing Test HAVE_C_WUNDEF - Success
Performing Test HAVE_CXX_WINIT_SELF
Performing Test HAVE_CXX_WINIT_SELF - Success
Performing Test HAVE_C_WINIT_SELF
Performing Test HAVE_C_WINIT_SELF - Success
Performing Test HAVE_CXX_WPOINTER_ARITH
Performing Test HAVE_CXX_WPOINTER_ARITH - Success
Performing Test HAVE_C_WPOINTER_ARITH
Performing Test HAVE_C_WPOINTER_ARITH - Success
Performing Test HAVE_CXX_WSHADOW
Performing Test HAVE_CXX_WSHADOW - Success
Performing Test HAVE_C_WSHADOW
Performing Test HAVE_C_WSHADOW - Success
Performing Test HAVE_CXX_WSIGN_PROMO
Performing Test HAVE_CXX_WSIGN_PROMO - Success
Performing Test HAVE_C_WSIGN_PROMO
Performing Test HAVE_C_WSIGN_PROMO - Failed
Performing Test HAVE_CXX_WNO_NARROWING
Performing Test HAVE_CXX_WNO_NARROWING - Success
Performing Test HAVE_C_WNO_NARROWING
Performing Test HAVE_C_WNO_NARROWING - Success
Performing Test HAVE_CXX_WNO_DELETE_NON_VIRTUAL_DTOR
Performing Test HAVE_CXX_WNO_DELETE_NON_VIRTUAL_DTOR - Success
Performing Test HAVE_C_WNO_DELETE_NON_VIRTUAL_DTOR
Performing Test HAVE_C_WNO_DELETE_NON_VIRTUAL_DTOR - Failed
Performing Test HAVE_CXX_WNO_UNNAMED_TYPE_TEMPLATE_ARGS
Performing Test HAVE_CXX_WNO_UNNAMED_TYPE_TEMPLATE_ARGS - Failed
Performing Test HAVE_C_WNO_UNNAMED_TYPE_TEMPLATE_ARGS
Performing Test HAVE_C_WNO_UNNAMED_TYPE_TEMPLATE_ARGS - Failed
Performing Test HAVE_CXX_FDIAGNOSTICS_SHOW_OPTION
Performing Test HAVE_CXX_FDIAGNOSTICS_SHOW_OPTION - Success
Performing Test HAVE_C_FDIAGNOSTICS_SHOW_OPTION
Performing Test HAVE_C_FDIAGNOSTICS_SHOW_OPTION - Success
Performing Test HAVE_CXX_WNO_LONG_LONG
Performing Test HAVE_CXX_WNO_LONG_LONG - Success
Performing Test HAVE_C_WNO_LONG_LONG
Performing Test HAVE_C_WNO_LONG_LONG - Success
Performing Test HAVE_CXX_PTHREAD
Performing Test HAVE_CXX_PTHREAD - Success
Performing Test HAVE_C_PTHREAD
Performing Test HAVE_C_PTHREAD - Success
Performing Test HAVE_CXX_FOMIT_FRAME_POINTER
Performing Test HAVE_CXX_FOMIT_FRAME_POINTER - Success
Performing Test HAVE_C_FOMIT_FRAME_POINTER
Performing Test HAVE_C_FOMIT_FRAME_POINTER - Success
Performing Test HAVE_CXX_MSSE
Performing Test HAVE_CXX_MSSE - Success
Performing Test HAVE_C_MSSE
Performing Test HAVE_C_MSSE - Success
Performing Test HAVE_CXX_MSSE2
Performing Test HAVE_CXX_MSSE2 - Success
Performing Test HAVE_C_MSSE2
Performing Test HAVE_C_MSSE2 - Success
Performing Test HAVE_CXX_MSSE3
Performing Test HAVE_CXX_MSSE3 - Success
Performing Test HAVE_C_MSSE3
Performing Test HAVE_C_MSSE3 - Success
Performing Test HAVE_CXX_FFUNCTION_SECTIONS
Performing Test HAVE_CXX_FFUNCTION_SECTIONS - Success
Performing Test HAVE_C_FFUNCTION_SECTIONS
Performing Test HAVE_C_FFUNCTION_SECTIONS - Success
Performing Test HAVE_CXX_FVISIBILITY_HIDDEN
Performing Test HAVE_CXX_FVISIBILITY_HIDDEN - Success
Performing Test HAVE_C_FVISIBILITY_HIDDEN
Performing Test HAVE_C_FVISIBILITY_HIDDEN - Success
Performing Test HAVE_CXX_FVISIBILITY_INLINES_HIDDEN
Performing Test HAVE_CXX_FVISIBILITY_INLINES_HIDDEN - Success
Performing Test HAVE_C_FVISIBILITY_INLINES_HIDDEN
Performing Test HAVE_C_FVISIBILITY_INLINES_HIDDEN - Failed
Looking for pthread.h
Looking for pthread.h - found
Check if the system is big endian
Searching 16 bit integer
Looking for sys/types.h
Looking for sys/types.h - found
Looking for stdint.h
Looking for stdint.h - found
Looking for stddef.h
Looking for stddef.h - found
Check size of unsigned short
Check size of unsigned short - done
Using unsigned short
Check if the system is big endian - little endian
Found ZLIB: /usr/lib/x86_64-linux-gnu/libz.so (found suitable version "1.2.8", minimum required is "1.2.3") 
Found TIFF: /usr/lib/x86_64-linux-gnu/libtiff.so (found version "4.0.3") 
Found JPEG: /usr/lib/x86_64-linux-gnu/libjpeg.so  
Performing Test HAVE_C_WNO_UNUSED_VARIABLE
Performing Test HAVE_C_WNO_UNUSED_VARIABLE - Success
Performing Test HAVE_C_WNO_SHADOW
Performing Test HAVE_C_WNO_SHADOW - Success
Performing Test HAVE_C_WNO_MAYBE_UNINITIALIZED
Performing Test HAVE_C_WNO_MAYBE_UNINITIALIZED - Success
Could NOT find Jasper (missing:  JASPER_LIBRARIES JASPER_INCLUDE_DIR) 
Performing Test HAVE_C_WNO_IMPLICIT_FUNCTION_DECLARATION
Performing Test HAVE_C_WNO_IMPLICIT_FUNCTION_DECLARATION - Success
Performing Test HAVE_C_WNO_UNINITIALIZED
Performing Test HAVE_C_WNO_UNINITIALIZED - Success
Performing Test HAVE_C_WNO_MISSING_PROTOTYPES
Performing Test HAVE_C_WNO_MISSING_PROTOTYPES - Success
Performing Test HAVE_C_WNO_UNUSED_BUT_SET_PARAMETER
Performing Test HAVE_C_WNO_UNUSED_BUT_SET_PARAMETER - Success
Performing Test HAVE_C_WNO_MISSING_DECLARATIONS
Performing Test HAVE_C_WNO_MISSING_DECLARATIONS - Success
Performing Test HAVE_C_WNO_UNUSED
Performing Test HAVE_C_WNO_UNUSED - Success
Performing Test HAVE_C_WNO_SIGN_COMPARE
Performing Test HAVE_C_WNO_SIGN_COMPARE - Success
Performing Test HAVE_C_WNO_STRICT_OVERFLOW
Performing Test HAVE_C_WNO_STRICT_OVERFLOW - Success
Performing Test HAVE_C_WNO_UNUSED_PARAMETER
Performing Test HAVE_C_WNO_UNUSED_PARAMETER - Success
Found ZLIB: /usr/lib/x86_64-linux-gnu/libz.so (found version "1.2.8") 
Found PNG: /usr/lib/x86_64-linux-gnu/libpng.so (found version "1.2.50") 
Looking for /usr/include/libpng/png.h
Looking for /usr/include/libpng/png.h - found
Looking for semaphore.h
Looking for semaphore.h - found
Performing Test HAVE_CXX_WNO_SHADOW
Performing Test HAVE_CXX_WNO_SHADOW - Success
Performing Test HAVE_CXX_WNO_UNUSED
Performing Test HAVE_CXX_WNO_UNUSED - Success
Performing Test HAVE_CXX_WNO_SIGN_COMPARE
Performing Test HAVE_CXX_WNO_SIGN_COMPARE - Success
Performing Test HAVE_CXX_WNO_UNDEF
Performing Test HAVE_CXX_WNO_UNDEF - Success
Performing Test HAVE_CXX_WNO_MISSING_DECLARATIONS
Performing Test HAVE_CXX_WNO_MISSING_DECLARATIONS - Success
Performing Test HAVE_CXX_WNO_UNINITIALIZED
Performing Test HAVE_CXX_WNO_UNINITIALIZED - Success
Performing Test HAVE_CXX_WNO_SWITCH
Performing Test HAVE_CXX_WNO_SWITCH - Success
Performing Test HAVE_CXX_WNO_PARENTHESES
Performing Test HAVE_CXX_WNO_PARENTHESES - Success
Performing Test HAVE_CXX_WNO_ARRAY_BOUNDS
Performing Test HAVE_CXX_WNO_ARRAY_BOUNDS - Success
Performing Test HAVE_CXX_WNO_EXTRA
Performing Test HAVE_CXX_WNO_EXTRA - Success
checking for module 'gtk+-3.0'
  found gtk+-3.0, version 3.10.8
checking for module 'gthread-2.0'
  found gthread-2.0, version 2.40.2
checking for module 'gstreamer-base-1.0'
  found gstreamer-base-1.0, version 1.2.4
checking for module 'gstreamer-video-1.0'
  found gstreamer-video-1.0, version 1.2.4
checking for module 'gstreamer-app-1.0'
  found gstreamer-app-1.0, version 1.2.4
checking for module 'gstreamer-riff-1.0'
  found gstreamer-riff-1.0, version 1.2.4
checking for module 'gstreamer-pbutils-1.0'
  found gstreamer-pbutils-1.0, version 1.2.4
checking for module 'libdc1394-2'
  package 'libdc1394-2' not found
checking for module 'libdc1394'
  package 'libdc1394' not found
checking for module 'libv4l1'
  package 'libv4l1' not found
Looking for linux/videodev.h
Looking for linux/videodev.h - not found
Looking for linux/videodev2.h
Looking for linux/videodev2.h - found
Looking for sys/videoio.h
Looking for sys/videoio.h - not found
checking for module 'libavcodec'
  found libavcodec, version 54.35.0
checking for module 'libavformat'
  found libavformat, version 54.20.4
checking for module 'libavutil'
  found libavutil, version 52.3.0
checking for module 'libswscale'
  found libswscale, version 2.1.1
Looking for libavformat/avformat.h
Looking for libavformat/avformat.h - found
Looking for ffmpeg/avformat.h
Looking for ffmpeg/avformat.h - not found
ICV: Removing previous unpacked package: /home/jeanpat/App/opencv-3.0.0-alpha/3rdparty/ippicv/unpack
ICV: Unpacking ippicv_linux_20140513.tgz to /home/jeanpat/App/opencv-3.0.0-alpha/3rdparty/ippicv/unpack...
ICV: Package successfully downloaded
found IPP (ICV version): 8.1.1 [8.1.1]
at: /home/jeanpat/App/opencv-3.0.0-alpha/3rdparty/ippicv/unpack/ippicv_lnx
CUDA detected: 5.5
CUDA NVCC target flags: -gencode;arch=compute_11,code=sm_11;-gencode;arch=compute_12,code=sm_12;-gencode;arch=compute_13,code=sm_13;-gencode;arch=compute_20,code=sm_20;-gencode;arch=compute_20,code=sm_21;-gencode;arch=compute_30,code=sm_30;-gencode;arch=compute_35,code=sm_35;-gencode;arch=compute_30,code=compute_30
Found PythonInterp: /usr/bin/python2.7 (found suitable version "2.7.6", minimum required is "2.7") 
Found PythonLibs: /usr/lib/x86_64-linux-gnu/libpython2.7.so (found suitable exact version "2.7.6") 
Found PythonInterp: /usr/bin/python3.4 (found suitable version "3.4", minimum required is "3.4") 
Found PythonLibs: /usr/lib/x86_64-linux-gnu/libpython3.4m.so (found suitable exact version "3.4.0") 
Found Sphinx 1.2.2: /usr/bin/sphinx-build
Could NOT find JNI (missing:  JAVA_INCLUDE_PATH JAVA_INCLUDE_PATH2 JAVA_AWT_INCLUDE_PATH) 
Could NOT find Matlab (missing:  MATLAB_MEX_SCRIPT MATLAB_INCLUDE_DIRS MATLAB_ROOT_DIR MATLAB_LIBRARIES MATLAB_LIBRARY_DIRS MATLAB_MEXEXT MATLAB_ARCH MATLAB_BIN) 
VTK is not found. Please set -DVTK_DIR in CMake to VTK build directory, or to VTK install subdirectory with VTKConfig.cmake file
Performing Test HAVE_CXX_WNO_UNUSED_PARAMETER
Performing Test HAVE_CXX_WNO_UNUSED_PARAMETER - Success
Performing Test HAVE_CXX_WNO_UNUSED_FUNCTION
Performing Test HAVE_CXX_WNO_UNUSED_FUNCTION - Success
Performing Test HAVE_CXX_WNO_UNUSED_VARIABLE
Performing Test HAVE_CXX_WNO_UNUSED_VARIABLE - Success
Performing Test HAVE_CXX_WNO_ENUM_COMPARE
Performing Test HAVE_CXX_WNO_ENUM_COMPARE - Success
Performing Test HAVE_CXX_WNO_UNUSED_BUT_SET_VARIABLE
Performing Test HAVE_CXX_WNO_UNUSED_BUT_SET_VARIABLE - Success
Performing Test HAVE_CXX_WNO_DEPRECATED_DECLARATIONS
Performing Test HAVE_CXX_WNO_DEPRECATED_DECLARATIONS - Success

General configuration for OpenCV 3.0.0-alpha =====================================
  Version control:               unknown

  Platform:
    Host:                        Linux 3.13.0-36-generic x86_64
    CMake:                       2.8.12.2
    CMake generator:             Unix Makefiles
    CMake build tool:            /usr/bin/make
    Configuration:               Release

  C/C++:
    Built as dynamic libs?:      YES
    C++ Compiler:                /usr/bin/c++  (ver 4.8.2)
    C++ flags (Release):         -fsigned-char -W -Wall -Werror=return-type -Werror=non-virtual-dtor -Werror=address -Werror=sequence-point -Wformat -Werror=format-security -Wmissing-declarations -Wundef -Winit-self -Wpointer-arith -Wshadow -Wsign-promo -Wno-narrowing -Wno-delete-non-virtual-dtor -fdiagnostics-show-option -Wno-long-long -pthread -fomit-frame-pointer -msse -msse2 -msse3 -ffunction-sections -fvisibility=hidden -fvisibility-inlines-hidden -O3 -DNDEBUG  -DNDEBUG
    C++ flags (Debug):           -fsigned-char -W -Wall -Werror=return-type -Werror=non-virtual-dtor -Werror=address -Werror=sequence-point -Wformat -Werror=format-security -Wmissing-declarations -Wundef -Winit-self -Wpointer-arith -Wshadow -Wsign-promo -Wno-narrowing -Wno-delete-non-virtual-dtor -fdiagnostics-show-option -Wno-long-long -pthread -fomit-frame-pointer -msse -msse2 -msse3 -ffunction-sections -fvisibility=hidden -fvisibility-inlines-hidden -g  -O0 -DDEBUG -D_DEBUG
    C Compiler:                  /usr/bin/cc
    C flags (Release):           -fsigned-char -W -Wall -Werror=return-type -Werror=non-virtual-dtor -Werror=address -Werror=sequence-point -Wformat -Werror=format-security -Wmissing-declarations -Wmissing-prototypes -Wstrict-prototypes -Wundef -Winit-self -Wpointer-arith -Wshadow -Wno-narrowing -fdiagnostics-show-option -Wno-long-long -pthread -fomit-frame-pointer -msse -msse2 -msse3 -ffunction-sections -fvisibility=hidden -O3 -DNDEBUG  -DNDEBUG
    C flags (Debug):             -fsigned-char -W -Wall -Werror=return-type -Werror=non-virtual-dtor -Werror=address -Werror=sequence-point -Wformat -Werror=format-security -Wmissing-declarations -Wmissing-prototypes -Wstrict-prototypes -Wundef -Winit-self -Wpointer-arith -Wshadow -Wno-narrowing -fdiagnostics-show-option -Wno-long-long -pthread -fomit-frame-pointer -msse -msse2 -msse3 -ffunction-sections -fvisibility=hidden -g  -O0 -DDEBUG -D_DEBUG
    Linker flags (Release):      
    Linker flags (Debug):        
    Precompiled headers:         YES

  OpenCV modules:
    To be built:                 cudev core flann imgproc imgcodecs videoio highgui features2d calib3d cudaarithm ml objdetect cudalegacy cudawarping cuda cudafilters cudaimgproc video cudabgsegm cudacodec cudafeatures2d cudaoptflow cudastereo photo shape stitching superres videostab python2 python3 ts
    Disabled:                    world
    Disabled by dependency:      -
    Unavailable:                 androidcamera java viz

  GUI: 
    QT:                          NO
    GTK+ 3.x:                    YES (ver 3.10.8)
    GThread :                    YES (ver 2.40.2)
    GtkGlExt:                    NO
    OpenGL support:              NO
    VTK support:                 NO

  Media I/O: 
    ZLib:                        /usr/lib/x86_64-linux-gnu/libz.so (ver 1.2.8)
    JPEG:                        /usr/lib/x86_64-linux-gnu/libjpeg.so (ver )
    WEBP:                        build (ver 0.3.1)
    PNG:                         /usr/lib/x86_64-linux-gnu/libpng.so (ver 1.2.50)
    TIFF:                        /usr/lib/x86_64-linux-gnu/libtiff.so (ver 42 - 4.0.3)
    JPEG 2000:                   build (ver 1.900.1)
    OpenEXR:                     build (ver 1.7.1)
    GDAL:                        NO

  Video I/O:
    DC1394 1.x:                  NO
    DC1394 2.x:                  NO
    FFMPEG:                      YES
      codec:                     YES (ver 54.35.0)
      format:                    YES (ver 54.20.4)
      util:                      YES (ver 52.3.0)
      swscale:                   YES (ver 2.1.1)
      gentoo-style:              YES
    GStreamer:                   
      base:                      YES (ver 1.2.4)
      video:                     YES (ver 1.2.4)
      app:                       YES (ver 1.2.4)
      riff:                      YES (ver 1.2.4)
      pbutils:                   YES (ver 1.2.4)
    OpenNI:                      NO
    OpenNI PrimeSensor Modules:  NO
    OpenNI2:                     NO
    PvAPI:                       NO
    GigEVisionSDK:               NO
    UniCap:                      NO
    UniCap ucil:                 NO
    V4L/V4L2:                    NO/YES
    XIMEA:                       NO
    Xine:                        NO

  Other third-party libraries:
    Use IPP:                     8.1.1 [8.1.1]
         at:                     /home/jeanpat/App/opencv-3.0.0-alpha/3rdparty/ippicv/unpack/ippicv_lnx
    Use IPP Async:               NO
    Use Eigen:                   NO
    Use TBB:                     NO
    Use OpenMP:                  NO
    Use GCD                      NO
    Use Concurrency              NO
    Use C=:                      NO
    Use Cuda:                    YES (ver 5.5)
    Use OpenCL:                  YES

  NVIDIA CUDA
    Use CUFFT:                   YES
    Use CUBLAS:                  NO
    USE NVCUVID:                 NO
    NVIDIA GPU arch:             11 12 13 20 21 30 35
    NVIDIA PTX archs:            30
    Use fast math:               NO

  OpenCL:
    Version:                     dynamic
    Include path:                /home/jeanpat/App/opencv-3.0.0-alpha/3rdparty/include/opencl/1.2
    Use AMDFFT:                  NO
    Use AMDBLAS:                 NO

  Python 2:
    Interpreter:                 /usr/bin/python2.7 (ver 2.7.6)
    Libraries:                   /usr/lib/x86_64-linux-gnu/libpython2.7.so (ver 2.7.6)
    numpy:                       /usr/local/lib/python2.7/dist-packages/numpy/core/include (ver 1.9.0)
    packages path:               lib/python2.7/dist-packages

  Python 3:
    Interpreter:                 /usr/bin/python3.4 (ver 3.4)
    Libraries:                   /usr/lib/x86_64-linux-gnu/libpython3.4m.so (ver 3.4.0)
    numpy:                       /usr/lib/python3/dist-packages/numpy/core/include (ver 1.8.2)
    packages path:               lib/python3.4/dist-packages

  Python (for build):            /usr/bin/python2.7

  Java:
    ant:                         NO
    JNI:                         NO
    Java tests:                  NO

  Matlab:
    mex:                         NO

  Documentation:
    Build Documentation:         YES
    Sphinx:                      /usr/bin/sphinx-build (ver 1.2.2)
    PdfLaTeX compiler:           /usr/bin/pdflatex
    PlantUML:                    NO

  Tests and samples:
    Tests:                       YES
    Performance tests:           YES
    C/C++ Examples:              NO

  Install path:                  /usr/local

  cvconfig.h is in:              /home/jeanpat/App/open-cv-3.0.0-a BUILD
-----------------------------------------------------------------

Configuring done

ça à l'air d'aller , l'étape "generate" aussi. Depuis le répertoire cible, make bloque à 11%

                                                                                                      ^
Scanning dependencies of target opencv_core
[ 11%] Building CXX object modules/core/CMakeFiles/opencv_core.dir/src/kdtree.cpp.o
[ 11%] Building CXX object modules/core/CMakeFiles/opencv_core.dir/src/parallel.cpp.o
[ 11%] Building CXX object modules/core/CMakeFiles/opencv_core.dir/src/lpsolver.cpp.o
[ 14%] Building CXX object modules/core/CMakeFiles/opencv_core.dir/src/umatrix.cpp.o
/home/jeanpat/App/opencv-3.0.0-alpha/modules/core/src/umatrix.cpp:44:35: fatal error: opencl_kernels_core.hpp: Aucun fichier ou dossier de ce type
 #include "opencl_kernels_core.hpp"
                                   ^
compilation terminated.
make[2]: *** [modules/core/CMakeFiles/opencv_core.dir/src/umatrix.cpp.o] Erreur 1
make[1]: *** [modules/core/CMakeFiles/opencv_core.dir/all] Erreur 2
make: *** [all] Erreur 2

Un petit tour dans synaptic montre que différentes lib avec opencl dont
opencl-headers , ocl-icd-opencl-dev sont installées

une idée?

merci

#21 Re : -1 »  Compiler opencv3 alpha avec support cuda: opencl_kernels_core.hpp ? » Le 07/11/2014, à 14:52

xanmoo
Réponses : 6

C'est bizarre, ce fichier se trouve dans un répertoire généré pendant l'exécution de la commande make :

/home/jeanpat/App/open-cv-3.0.0-a\ BUILD/modules/core

Ce répertoire est crée au moment du message d'erreur, lorsque je lance la commande

make

depuis le répertoire cible:

/home/jeanpat/App/open-cv-3.0.0-a BUILD

#22 Re : -1 »  Compiler opencv3 alpha avec support cuda: opencl_kernels_core.hpp ? » Le 08/11/2014, à 10:42

xanmoo
Réponses : 6

bon ben pas d'espace dans le nom du répertoire cible, ça marche beaucoup mieux ... roll

merci

#23 -1 »  Touchpad gelé avec pilote nvidia (degel par ctrl+F6 et ctrl+F7) » Le 06/11/2014, à 14:03

xanmoo
Réponses : 2

Bonjour à tous,

Je suis l'heureux proprio d'un portable ldlc saturn : cpu i5 avec carte intel integrée + GPU NVidia 740M.
Quand on bascule l'affichage sous NVidia, il arrive que le curseur soit gelé (touchpad ou souris). La solution que j'ai trouvé consiste à basculer dans une console par CTRL+F6 puis à revenir dans l'affichage graphique par CTRL+F7.
C'est pas dramatique mais ça craint un peu quand même, je ne me voit pas faire cette manip au milieu d'une présentation.

Comment debuguer la chose?

Merci

Jean patrick

#24 Re : -1 »  Touchpad gelé avec pilote nvidia (degel par ctrl+F6 et ctrl+F7) » Le 07/11/2014, à 09:37

xanmoo
Réponses : 2

Argh!!
Est-ce que tu sais si on peut utiliser CUDA ( ex pycuda) sans que le pilote nvidia soit activé?
J'ai remarqué aussi que le branchement à chaud d'un vidéoprojecteur avec le pilote intel échouait (c'est à dire que le bureau était visible mais pas les applications!! Au passage les utilisateurs d'un portable sous windows 8 ne se posent pas de question,on branche et ça marche ...) est-ce que le branchement à chaud fonctionne avec nvidia?

Blabladodo a écrit :

l'utilisation d'une souris à part permet de contourner le bug,

C'est pas sur, le bug s'est quand même produit avec une souris... mais je n'avais relancé la session.