Contenu | Rechercher | Menus

Annonce

Si vous rencontrez des soucis à rester connecté sur le forum (ou si vous avez perdu votre mot de passe) déconnectez-vous et reconnectez-vous depuis cette page, en cochant la case "Me connecter automatiquement lors de mes prochaines visites". Attention, le forum rencontre actuellement quelques difficultés. En cas d'erreur 502, il ne faut pas re-valider l'envoi d'un message ou l'ouverture d'une discussion, au risque de créer un doublon.

La section divers se réorganise ! De nouvelles sous-sections à venir. (plus d'infos + donner son avis)

nombre réponses : 25

#0 Re : -1 »  [Résolu] Incruster des sous-titres » Le 29/04/2009, à 11:14

kelk'1
Réponses : 115

Bonjour,
J'ai enfin réussi à trouver les bons paramètres pour incruster des sous-titres dans une vidéo et l'encoder dans un format compatible avec mon ipod ! maintenant ca marche nickel, alors voila la commande que j'utilise :

mencoder  INPUT.avi -sws 9 -of lavf -lavfopts format=mp4 -sub INPUT.srt -fontconfig -font Arial -subfont-text-scale 4 -vf scale=320:240,dsize=320:240,harddup -ovc x264 -x264encopts bitrate=768:vbv_maxrate=768:vbv_bufsize=1000:nocabac:me=umh:trellis=1:level_idc=30:global_header:threads=2:pass=1:turbo -oac faac -faacopts mpeg=4:object=2:br=160:raw -channels 2 -srate 48000 -o OUTPUT.mp4

#1 -1 »  Drivers alsa pour Realtek hda-intel sous Maverick 64bits » Le 04/10/2010, à 11:45

kelk'1
Réponses : 3

Bonjour,
J'ai un Toshiba L630-10r, j'ai installé 10.10 beta (64bits) dessus. Je suis super satisfait par la compatibilité d'ubuntu avec mon pc (par rapport aux anciens que j'ai eu)
Il ne me reste plus qu'un petit probleme avec le son que j'ai essayé de résoudre :
Le son marche parfaitement sauf que le micro integré et les prises casque ne marchent pas.

J'ai donc fait des recherches sur ma carte son :

~$ lspci | grep [Aa]udio
00:1b.0 Audio device: Intel Corporation 5 Series/3400 Series Chipset High Definition Audio (rev 05)
01:00.1 Audio device: ATI Technologies Inc RV710/730

J'ai suivi ce topic : http://forum.ubuntu-fr.org/viewtopic.php?id=418544

Mais au lieu d'installer a la main j'ai executé le script fourni (en sudo -i) qui fait ca en résumé :

tar jxvpf alsa-driver-1.0.23-$ver.tar.bz2 > /dev/null 2>&1
## remove driver modules
if [ -f /etc/rc.d/init.d/alsasound ]; then
   /etc/init.d/alsasound stop
   /etc/init.d/alsasound stop
   rmmod snd-page-alloc > /dev/null 2>&1
   rmmod soundcore > /dev/null 2>&1
fi
echo "Compile Driver........"
cd alsa-driver-1.0.23
./configure --with-cards=hda-intel
make
echo "Remove old sound driver"
if [ -d /lib/modules/$kaversion/kernel/sound ]; then
   rm -rf /lib/modules/$kaversion/kernel/sound/pci > /dev/null 2>&1
   rm -rf /lib/modules/$kaversion/kernel/sound/acore > /dev/null 2>&1
   rm -rf /lib/modules/$kaversion/kernel/sound/core > /dev/null 2>&1
fi
if [ -f /etc/asound.state ]; then
   rm -rf /etc/asound.state > /dev/null 2>&1
fi
echo "Remove Folder....."
rm -rf alsa-driver-1.0.23 > /dev/null

Mais les sources du site de Realtek ne compilent pas ce script a au passage supprimé les drivers alsa déja présents chez moi :

/usr/src/alsa-driver-1.0.23/acore/pcm_native.c: In function ‘snd_pcm_hw_params’:
/usr/src/alsa-driver-1.0.23/acore/pcm_native.c:489: error: implicit declaration of function ‘pm_qos_remove_requirement’
/usr/src/alsa-driver-1.0.23/acore/pcm_native.c:492: error: implicit declaration of function ‘pm_qos_add_requirement’
make[3]: *** [/usr/src/alsa-driver-1.0.23/acore/pcm_native.o] Error 1
make[2]: *** [/usr/src/alsa-driver-1.0.23/acore] Error 2
make[1]: *** [_module_/usr/src/alsa-driver-1.0.23] Error 2
make[1]: Leaving directory `/usr/src/linux-headers-2.6.35-22-generic'
make: *** [compile] Error 2

Apres quelques recherches je suis tombé sur cette discussion : http://www.spinics.net/linux/fedora/als … 09284.html

J'ai donc essayé de compiler les drivers alsa presents ici : http://www.alsa-project.org/snapshot/

J'ai compilé et installé avec succes:
- alsa-driver-1.0.23.75.g04a15.554.g80f5d
- alsa-lib-1.0.23.24.gc049d
- alsa-utils-1.0.23.15.gef919

Mais apres reboot , toujours rien !
Et la je ne sais plus quoi faire !
Du coup je me retrouve sans son du tout !

Quelqu'un aurait il une idée de ce qu'il faut faire ?

Merci d'avance.

#2 Re : -1 »  Drivers alsa pour Realtek hda-intel sous Maverick 64bits » Le 05/10/2010, à 09:49

kelk'1
Réponses : 3

Ce qui m'inquiete le plus c'est qu'il me semble que tout ce qui est en rapport avec le son a été effacé de mon pc !

~$ cat /proc/asound/version
cat: /proc/asound/version: No such file or directory
~$ ls -d /proc/a*
/proc/acpi  /proc/ati
~$ aplay -l
aplay: device_list:240: no soundcards found...
~$ alsamixer
cannot open mixer: No such file or directory

J'ai pourtant reinstallé tout les paquets en rapport avec alsa, mais rien !

Je ne sais plus quoi faire !

#4 -1 »  Choix entre plusieurs portables 13", i3 » Le 27/07/2010, à 18:54

kelk'1
Réponses : 4

Bonjour,
je suis étudiant en informatique et je vais acheter un nouveau portable pour la rentrée,
j'hesite entre 4 modeles assez proches :
HP ProBook 4320s (WD876EA): 849€
http://www.fnac.com/HP-ProBook-4320S-13 … 880980/w-4
+++
Théoriquement compatible linux a 100% (existe avec SuSE linux sur le site de HP)
Dispose d'une carte graphique
Modele "pro" donc meilleur que les modeles Mr tout le monde
---
Config la plus faible des 3 (3Go RAM et 320Go HDD)
les portables HP ont une plus mauvaise reputation que les 3 autres marques

Toshiba Satellite L630-10R : 699€
http://www.fnac.com/Toshiba-Satellite-L … 870858/w-4
+++
Config puissante
Dispose d'une carte graphique
---
La compatibilité avec linux me fait peur, j'ai rien trouvé sur internet la dessus si ce n'est quelques pages ou ils disent que ce n'est pas fameux.

Asus U30JC-QX065V: 719€
http://www.fnac.com/Asus-U30JC-QX065V-1 … 840024/w-4
+++
Config la plus puissante des 3
Compatible avec linux d'apres la page  Asus de ce site
Autonomie assez bonne (~4 a 6h)
---
Carte graphique inutile puisque la technologie Optimus n'est pas prise en charge (et ne le sera a priori pas avant un bon bout de temps !)

Dell Vostro 3300: 740€ = 680 + 60 pour la carte graphique
(i3-370M , 3Go RAM, 320Go HDD, NVidia GeForce 310M)
+++
Compatibilité linux tres bonne (pour le Vostro 3700 mais je suppose que c'est pareil)
Processeur le plus puissant
---
Batterie 4cellules seulement (je ne sais pas ce que ca donne en termes d'autonomie.
Config un peu faible

Acer Aspire TimelineX 3820T-334G32n: 606€
http://www.ldlc.be/fiche/PB00101726.html
+++
Autonomie hallucinante (8h annoncée)
Ecran LED
---
Pas de carte graphique
Marque réputée pour la mauvaise qualité de ses pc.

Avec tout ca je me sens completement largué !
Je ne sais pas lequel choisir ou si il y en a d'autres dans la meme gamme (13.3", i3) (Toshiba Satellite U500? )
Et je me pose aussi des questions quant a l'autonomie des 2 premiers.

Je ne sais pas ce que vous en pensez ? Avez vous d'autres +++ ou --- a ajouter ?

Merci d'avance pour votre aide !

EDIT: Ajout de l'Acer Aspire TimelineX 3820T-334G32n

#5 Re : -1 »  Choix entre plusieurs portables 13", i3 » Le 28/07/2010, à 08:41

kelk'1
Réponses : 4

Merci pour ton aide.
Mais j'ai déja fait le tour ici et j'ai déja vu cette page. et franchement, il n'y a pas grand chose d'interessant dedans.
Je cherche quelque chose d'assez particulier, (13.3", i3) donc j'aimerai un retour de personnes possedant une machine comme ca.
Bonne journée.

#6 Re : -1 »  Choix entre plusieurs portables 13", i3 » Le 08/08/2010, à 17:47

kelk'1
Réponses : 4

Merci beaucoup, je ne connaissais pas ce modele. Il m'a l'air tres bien. Peut etre le meilleur d'entre eux.
Je vais le rajouter a la liste tiens !

#7 -1 »  Probleme d'installation du driver Poulsbo » Le 28/02/2010, à 14:45

kelk'1
Réponses : 0

Bonjour,
je suis sous jaunty
mon kernel est 2.6.33-020633-generic
j'ai suivi les instructions décrites sur la page de la documentaion de poulsbo : http://doc.ubuntu-fr.org/poulsbo
mais l'installation la compilation de psb-kernel-source échoue :

Loading new psb-kernel-source-4.41.1 DKMS files...

Creating symlink /var/lib/dkms/psb-kernel-source/4.41.1/source ->
                 /usr/src/psb-kernel-source-4.41.1

DKMS: add Completed.
Installing prebuilt kernel module binaries (if any)
Building module...

Kernel preparation unnecessary for this kernel.  Skipping...

Building module:
cleaning build area....
make KERNELRELEASE=2.6.33-020633-generic LINUXDIR=/lib/modules/2.6.33-020633-generic/build DRM_MODULES=psb.....(bad exit status: 2)

Error! Bad return status for module build on kernel: 2.6.33-020633-generic (i686)
Consult the make.log in the build directory
/var/lib/dkms/psb-kernel-source/4.41.1/build/ for more information.
0
0
dpkg: error processing psb-kernel-source (--configure):
 subprocess post-installation script returned error exit status 10
Errors were encountered while processing:
 psb-kernel-source
E: Sub-process /usr/bin/dpkg returned an error code (1)

et voila le contenu du fichier make.log

DKMS make.log for psb-kernel-source-4.41.1 for kernel 2.6.33-020633-generic (i686)
Sun Feb 28 14:51:26 CET 2010
make -C /lib/modules/2.6.33-020633-generic/build  SUBDIRS=`pwd` DRMSRCDIR=`pwd` modules
make[1]: Entering directory `/usr/src/linux-headers-2.6.33-020633-generic'
  CC [M]  /var/lib/dkms/psb-kernel-source/4.41.1/build/drm_auth.o
In file included from /var/lib/dkms/psb-kernel-source/4.41.1/build/drmP.h:93,
                 from /var/lib/dkms/psb-kernel-source/4.41.1/build/drm_auth.c:36:
/var/lib/dkms/psb-kernel-source/4.41.1/build/drm_os_linux.h:54: error: conflicting types for ‘irqretu$
include/linux/irqreturn.h:16: error: previous declaration of ‘irqreturn_t’ was here
make[2]: *** [/var/lib/dkms/psb-kernel-source/4.41.1/build/drm_auth.o] Error 1
make[1]: *** [_module_/var/lib/dkms/psb-kernel-source/4.41.1/build] Error 2
make[1]: Leaving directory `/usr/src/linux-headers-2.6.33-020633-generic'
make: *** [modules] Error 2

je ne sais plus quoi faire ...

#8 -1 »  Gros probleme de connexion avec les logiciels de messagerie » Le 18/02/2010, à 12:37

kelk'1
Réponses : 0

Bonjour,
J'ai un eeepc 1101HA , j'etais sous xp et la je viens d'installer crunchbang linux ( ubuntu jaunty ).
j'ai bien galéré pour installer le réseau et la carte graphique, mais maintenant c'est ok
mon gros probleme est qu'absolument aucun logiciel de messagerie instantanée ne veut se connecter
j'ai essayé :
- empathy avec les protocoles gmail et msn : network error
- amsn : ne se connecte pas
- emesene : ne se connecte pas
- ekiga

sachant que tout marchait nickel sous windows, et que tout marche avec des logiciel web based ( web messenger, gmail )

je n'ai pas touché a mon pare feu ( iptables -L donne aucune regle + que des policy ACCEPT )

je suis connecté en wifi avec une connexion vpn cisco
je pense que le probleme pourrait venir de la connexion ( ports bloqués ? ) mais cela n'explique pas le fait que tout marche sous xp avec la meme connexion

je suis vraiment désespéré

#9 -1 »  Projet de borne d'arcade perso ! » Le 02/07/2009, à 15:09

kelk'1
Réponses : 15

Bonjour, c'est l'été et pour m'occuper j'ai décidé de fabriquer ma borne d'arcade !
alors, après un tour sur une multitude de forums, il me semble que la meilleure solutions soit d'utiliser sdlmame + wahcade ! je veux bien, mais après les avoir installés sur mon pc (pour tester) je n'ai pas su les configurer ... du tout.
a part ca, ce que je veut faire c'est un systeme de telle sorte que ca boote direct sur wahcade en plein écran (pas de GDM, pas de gnome, rien, même pas de grub), j'aurais plusieurs questions la dessus :

- je pense à une config : PIII 1GHz, 512mb RAM, Geforce2 128mb, 80Go HDD. Est ce suffisant ?
- je me demande si il faut installer la version serveur d'ubuntu (ou si vous me conseillez une autre distrib plus légère et adaptée à ce que je veut faire)  puis installer mes logiciels et tt ce qui manque ou alors installer une version desktop et enlever tout le superflu ?
- il faudrait que je trouve un moyen pour la maintenance du systeme , pour cela j'ai pensé à l'utilisation d'un live cd au besoin, puisque il n'y aura rien d'installé sur la machine, vous en pensez quoi ?

j'ai fait des recherches sur ce forum , j'ai trouvé des choses qui semblent être liées mais j'y ai rien compris :
http://forum.ubuntu-fr.org/viewtopic.php?id=6775
http://forum.ubuntu-fr.org/viewtopic.php?id=179160

#10 Re : -1 »  Projet de borne d'arcade perso ! » Le 23/07/2009, à 11:06

kelk'1
Réponses : 15

Salut, merci pour vos posts,

alors, j'ai réussi à avoir (gratos big_smile) une machine bien plus puissante que ce que je pensais
j'ai maintenant un P4 1.6 Ghz avec 512mb de ram et une geforce 5200 donc j'ai décidé de rajouter un truc super original sur ma borne, désormais ca sera une borne d'arcade + frets on fire !
j'ai acheté 2 guitares pour xbox 360, elles marchent nickel !

je suis entrain de configurer le tout, j'ai installé la version desktop afin de tout configurer en étant plus à l'aise et je trouverai bien un moyen de supprimer le gnome après.

j'ai installé zsnes pour la snes, sdlmame pour l'arcade, frets on fire X pour les guitares, et je pense rajouter vbadvance pour la GBA et peut être un atari ( pong, space invaders, ...)
pour le moment tout est OK mais je ne me suis pas encore intéressé à la configuration des commandes. je pense que ca va me compliquer un peu les choses, surtout le hack clavier.

@ludal : si jamais le fait d'installer une version serveur apportait une grande différence en termes de performances au dépend de la facilité de configuration, je suis prêt à tout réinstaller, mais bon avec ma config, je pense qu'il n'y a pas vraiment de différence.

ah au fait, j'ai trouvé un nom pour ma machine, c'est la JIMTAC (Jimtac Is More Than an Arcade Cabinet)

#11 Re : -1 »  Projet de borne d'arcade perso ! » Le 03/08/2009, à 14:48

kelk'1
Réponses : 15

Bon, après multiple bidouillages, j'ai des problèmes de ralentissements avec sdlmame, sur certains jeux, notamment les neogeo, je tourne aux alentours des 40-50% ce qui n'est pas normal. j'ai enlevé tout les filtres video, mais ca n'a rien donné, j'espère que ce n'est pas une limitation de mon matériel !
help please ...

#12 Re : -1 »  Projet de borne d'arcade perso ! » Le 03/08/2009, à 15:15

kelk'1
Réponses : 15

euh... attendez que je regarde , j'ai mis  antialias 0, flicker 0 et tout les truc de #Open GL SPECIFIC OPTIONS en 0 et none

#13 Re : -1 »  Projet de borne d'arcade perso ! » Le 03/08/2009, à 15:26

kelk'1
Réponses : 15

je viens de mettre le autoframeskip et le frameskip en 1 et je suis en 76%, c'est mieux, mais pas encore satisfaisant

#14 Re : -1 »  Projet de borne d'arcade perso ! » Le 03/08/2009, à 16:03

kelk'1
Réponses : 15
abelthorne a écrit :

- "video" est bien en "opengl" ?

oui smile

sinon je viens de tout mettre comme toi, et mslugx tourne maintenant a 79%, je vais quand même essayer d'améliorer un peu ca.

a part ca j'ai remarqué que dans plusieurs jeux neogeo (si ce n'est tous) il y a au début du jeu un écran vert bizarre
je ne sais pas d'ou ca vient mais ca disparait quand le jeu commence

#15 Re : -1 »  Projet de borne d'arcade perso ! » Le 03/08/2009, à 17:25

kelk'1
Réponses : 15

bah non, j'ai copié ma config sur celle d'abelthorne et je ne pense pas qu'il y ait de filtre activé, si tu pouvais mettre un bout de ton mame.ini ca serait cool !

#16 -1 »  Coloration syntaxique sous maple 12 » Le 19/06/2009, à 12:55

kelk'1
Réponses : 1

Bonjour, j'écris sous maple 12 et je voudrais colorier mon code ! malheureusement , sous maple, seul la coloration manuelle est présente,
pourriez vous m'indiquer un éditeur de texte ou autre programme ou bien n'importe quel moyen de colorier automatiquement mon code, car pour le présenter ce n'est pas évident quand c'est écrit tout en rouge !!
merci smile

#17 Re : -1 »  Probleme de son » Le 30/04/2009, à 08:13

kelk'1
Réponses : 16

Moi aussi j'ai un problème de son sur Jaunty, mais ce qui est bizarre c'est que c'est juste la sortie avant de mon ordi qui marche, je m'explique, sur mon ordi il y a une sortie mini jack à l'avant pour brancher un casque, et le son marche quand je me branche dessus, par contre il ne marche pas quand je me branche sur la fiche arrière que j'utilise depuis toujours !

#18 -1 »  Carte Réseau PCI : D-Link DFE-530TX » Le 21/10/2008, à 21:56

kelk'1
Réponses : 8

Bonjour, j'ai un pc auquel je viens d'installer linux 8.04 , tout est nickel sauf ma carte réseau qu'il ne reconnait pas, c'est une D-Link DFE-530TX, je vais sur le site officiel et je trouve des pilotes pour linux sous forme de sources : dlkfet-4.24.tar.gz
je voudrais savoir quelle est la procédure pour les installer sur mon pc sachant que je n'ai pas internet dessus (donc si il y a besoin d'autres paquets, veuillez me signaler lesquels et ou les trouver)
merci d'avance

#20 Re : -1 »  Carte Réseau PCI : D-Link DFE-530TX » Le 22/10/2008, à 21:43

kelk'1
Réponses : 8

up !
apparemment mon problème n'interesse personne ! tongue

#21 Re : -1 »  Carte Réseau PCI : D-Link DFE-530TX » Le 23/10/2008, à 17:35

kelk'1
Réponses : 8

bonjour
j'ai réussi a me connecter sur internet a partir du pc a l'aide d'une clé wifi,
j'ai bidouillé un peu:
j'ai installé build-essentials
j'ai extrait les sources
j'ai essayé de compiler : erreur : missing configure.h
j'ai installé le kernel-headers de mon noyau
j'ai essayé de compiler : erreur : missing configure.h
j'ai crée un lien de autoconf.h vers config.h
j'ai essayé de compiler : ca essaye de compiler mais ca marche toujours pas
voila ce que j'obtiens :

/lib/modules/2.6.24-19-generic/build/include/asm/paravirt.h:489: erreur: expected identifier or «(» before «asm»
Dans le fichier inclus à partir de /lib/modules/2.6.24-19-generic/build/include/asm/processor_32.h:578,
          à partir de /lib/modules/2.6.24-19-generic/build/include/asm/processor.h:2,
          à partir de /lib/modules/2.6.24-19-generic/build/include/asm/atomic_32.h:5,
          à partir de /lib/modules/2.6.24-19-generic/build/include/asm/atomic.h:2,
          à partir de /lib/modules/2.6.24-19-generic/build/include/linux/proc_fs.h:8,
          à partir de rhine.h:48,
          à partir de rhine_main.c:18:
/lib/modules/2.6.24-19-generic/build/include/asm/paravirt.h:494:29: erreur: la macro « clts » a reçu 1 arguments, mais elle n'en prend que 0
/lib/modules/2.6.24-19-generic/build/include/asm/paravirt.h:495: erreur: expected «=», «,», «;», «asm» or «__attribute__» before «{» token
/lib/modules/2.6.24-19-generic/build/include/asm/paravirt.h:500: erreur: redefinition of «read_cr0»
/lib/modules/2.6.24-19-generic/build/include/asm/system_64.h:78: erreur: previous definition of «read_cr0» was here
/lib/modules/2.6.24-19-generic/build/include/asm/paravirt.h:505: erreur: redefinition of «write_cr0»
/lib/modules/2.6.24-19-generic/build/include/asm/system_64.h:85: erreur: previous definition of «write_cr0» was here
/lib/modules/2.6.24-19-generic/build/include/asm/paravirt.h:510: erreur: redefinition of «read_cr2»
/lib/modules/2.6.24-19-generic/build/include/asm/system_64.h:90: erreur: previous definition of «read_cr2» was here
/lib/modules/2.6.24-19-generic/build/include/asm/paravirt.h:515: erreur: redefinition of «write_cr2»
/lib/modules/2.6.24-19-generic/build/include/asm/system_64.h:97: erreur: previous definition of «write_cr2» was here
/lib/modules/2.6.24-19-generic/build/include/asm/paravirt.h:520: erreur: redefinition of «read_cr3»
/lib/modules/2.6.24-19-generic/build/include/asm/system_64.h:102: erreur: previous definition of «read_cr3» was here
/lib/modules/2.6.24-19-generic/build/include/asm/paravirt.h:525: erreur: redefinition of «write_cr3»
/lib/modules/2.6.24-19-generic/build/include/asm/system_64.h:109: erreur: previous definition of «write_cr3» was here
/lib/modules/2.6.24-19-generic/build/include/asm/paravirt.h:530: erreur: redefinition of «read_cr4»
/lib/modules/2.6.24-19-generic/build/include/asm/system_64.h:114: erreur: previous definition of «read_cr4» was here
/lib/modules/2.6.24-19-generic/build/include/asm/paravirt.h:539: erreur: redefinition of «write_cr4»
/lib/modules/2.6.24-19-generic/build/include/asm/system_64.h:121: erreur: previous definition of «write_cr4» was here
/lib/modules/2.6.24-19-generic/build/include/asm/paravirt.h:553:31: erreur: la macro « wbinvd » a reçu 1 arguments, mais elle n'en prend que 0
/lib/modules/2.6.24-19-generic/build/include/asm/paravirt.h:554: erreur: expected «=», «,», «;», «asm» or «__attribute__» before «{» token
/lib/modules/2.6.24-19-generic/build/include/asm/paravirt.h:570:1: attention : « rdmsr » redéfini
Dans le fichier inclus à partir de /lib/modules/2.6.24-19-generic/build/include/asm/processor_64.h:16,
          à partir de /lib/modules/2.6.24-19-generic/build/include/asm/processor.h:4,
          à partir de /lib/modules/2.6.24-19-generic/build/include/linux/prefetch.h:14,
          à partir de /lib/modules/2.6.24-19-generic/build/include/linux/list.h:8,
          à partir de /lib/modules/2.6.24-19-generic/build/include/linux/module.h:9,
          à partir de rhine.h:23,
          à partir de rhine_main.c:18:
/lib/modules/2.6.24-19-generic/build/include/asm/msr.h:93:1: attention : ceci est la localisation d'une précédente définition
Dans le fichier inclus à partir de /lib/modules/2.6.24-19-generic/build/include/asm/processor_32.h:578,
          à partir de /lib/modules/2.6.24-19-generic/build/include/asm/processor.h:2,
          à partir de /lib/modules/2.6.24-19-generic/build/include/asm/atomic_32.h:5,
          à partir de /lib/modules/2.6.24-19-generic/build/include/asm/atomic.h:2,
          à partir de /lib/modules/2.6.24-19-generic/build/include/linux/proc_fs.h:8,
          à partir de rhine.h:48,
          à partir de rhine_main.c:18:
/lib/modules/2.6.24-19-generic/build/include/asm/paravirt.h:581:1: attention : « rdmsrl » redéfini
Dans le fichier inclus à partir de /lib/modules/2.6.24-19-generic/build/include/asm/processor_64.h:16,
          à partir de /lib/modules/2.6.24-19-generic/build/include/asm/processor.h:4,
          à partir de /lib/modules/2.6.24-19-generic/build/include/linux/prefetch.h:14,
          à partir de /lib/modules/2.6.24-19-generic/build/include/linux/list.h:8,
          à partir de /lib/modules/2.6.24-19-generic/build/include/linux/module.h:9,
          à partir de rhine.h:23,
          à partir de rhine_main.c:18:
/lib/modules/2.6.24-19-generic/build/include/asm/msr.h:105:1: attention : ceci est la localisation d'une précédente définition
Dans le fichier inclus à partir de /lib/modules/2.6.24-19-generic/build/include/asm/processor_32.h:578,
          à partir de /lib/modules/2.6.24-19-generic/build/include/asm/processor.h:2,
          à partir de /lib/modules/2.6.24-19-generic/build/include/asm/atomic_32.h:5,
          à partir de /lib/modules/2.6.24-19-generic/build/include/asm/atomic.h:2,
          à partir de /lib/modules/2.6.24-19-generic/build/include/linux/proc_fs.h:8,
          à partir de rhine.h:48,
          à partir de rhine_main.c:18:
/lib/modules/2.6.24-19-generic/build/include/asm/paravirt.h:586:1: attention : « wrmsrl » redéfini
Dans le fichier inclus à partir de /lib/modules/2.6.24-19-generic/build/include/asm/processor_64.h:16,
          à partir de /lib/modules/2.6.24-19-generic/build/include/asm/processor.h:4,
          à partir de /lib/modules/2.6.24-19-generic/build/include/linux/prefetch.h:14,
          à partir de /lib/modules/2.6.24-19-generic/build/include/linux/list.h:8,
          à partir de /lib/modules/2.6.24-19-generic/build/include/linux/module.h:9,
          à partir de rhine.h:23,
          à partir de rhine_main.c:18:
/lib/modules/2.6.24-19-generic/build/include/asm/msr.h:108:1: attention : ceci est la localisation d'une précédente définition
Dans le fichier inclus à partir de /lib/modules/2.6.24-19-generic/build/include/asm/processor_32.h:578,
          à partir de /lib/modules/2.6.24-19-generic/build/include/asm/processor.h:2,
          à partir de /lib/modules/2.6.24-19-generic/build/include/asm/atomic_32.h:5,
          à partir de /lib/modules/2.6.24-19-generic/build/include/asm/atomic.h:2,
          à partir de /lib/modules/2.6.24-19-generic/build/include/linux/proc_fs.h:8,
          à partir de rhine.h:48,
          à partir de rhine_main.c:18:
/lib/modules/2.6.24-19-generic/build/include/asm/paravirt.h:590:1: attention : « rdmsr_safe » redéfini
Dans le fichier inclus à partir de /lib/modules/2.6.24-19-generic/build/include/asm/processor_64.h:16,
          à partir de /lib/modules/2.6.24-19-generic/build/include/asm/processor.h:4,
          à partir de /lib/modules/2.6.24-19-generic/build/include/linux/prefetch.h:14,
          à partir de /lib/modules/2.6.24-19-generic/build/include/linux/list.h:8,
          à partir de /lib/modules/2.6.24-19-generic/build/include/linux/module.h:9,
          à partir de rhine.h:23,
          à partir de rhine_main.c:18:
/lib/modules/2.6.24-19-generic/build/include/asm/msr.h:117:1: attention : ceci est la localisation d'une précédente définition
Dans le fichier inclus à partir de /lib/modules/2.6.24-19-generic/build/include/asm/processor_32.h:578,
          à partir de /lib/modules/2.6.24-19-generic/build/include/asm/processor.h:2,
          à partir de /lib/modules/2.6.24-19-generic/build/include/asm/atomic_32.h:5,
          à partir de /lib/modules/2.6.24-19-generic/build/include/asm/atomic.h:2,
          à partir de /lib/modules/2.6.24-19-generic/build/include/linux/proc_fs.h:8,
          à partir de rhine.h:48,
          à partir de rhine_main.c:18:
/lib/modules/2.6.24-19-generic/build/include/asm/paravirt.h:603:1: attention : « rdtscl » redéfini
Dans le fichier inclus à partir de /lib/modules/2.6.24-19-generic/build/include/asm/processor_64.h:16,
          à partir de /lib/modules/2.6.24-19-generic/build/include/asm/processor.h:4,
          à partir de /lib/modules/2.6.24-19-generic/build/include/linux/prefetch.h:14,
          à partir de /lib/modules/2.6.24-19-generic/build/include/linux/list.h:8,
          à partir de /lib/modules/2.6.24-19-generic/build/include/linux/module.h:9,
          à partir de rhine.h:23,
          à partir de rhine_main.c:18:
/lib/modules/2.6.24-19-generic/build/include/asm/msr.h:126:1: attention : ceci est la localisation d'une précédente définition
Dans le fichier inclus à partir de /lib/modules/2.6.24-19-generic/build/include/asm/processor_32.h:578,
          à partir de /lib/modules/2.6.24-19-generic/build/include/asm/processor.h:2,
          à partir de /lib/modules/2.6.24-19-generic/build/include/asm/atomic_32.h:5,
          à partir de /lib/modules/2.6.24-19-generic/build/include/asm/atomic.h:2,
          à partir de /lib/modules/2.6.24-19-generic/build/include/linux/proc_fs.h:8,
          à partir de rhine.h:48,
          à partir de rhine_main.c:18:
/lib/modules/2.6.24-19-generic/build/include/asm/paravirt.h:608:1: attention : « rdtscll » redéfini
Dans le fichier inclus à partir de /lib/modules/2.6.24-19-generic/build/include/asm/processor_64.h:16,
          à partir de /lib/modules/2.6.24-19-generic/build/include/asm/processor.h:4,
          à partir de /lib/modules/2.6.24-19-generic/build/include/linux/prefetch.h:14,
          à partir de /lib/modules/2.6.24-19-generic/build/include/linux/list.h:8,
          à partir de /lib/modules/2.6.24-19-generic/build/include/linux/module.h:9,
          à partir de rhine.h:23,
          à partir de rhine_main.c:18:
/lib/modules/2.6.24-19-generic/build/include/asm/msr.h:129:1: attention : ceci est la localisation d'une précédente définition
Dans le fichier inclus à partir de /lib/modules/2.6.24-19-generic/build/include/asm/processor_32.h:578,
          à partir de /lib/modules/2.6.24-19-generic/build/include/asm/processor.h:2,
          à partir de /lib/modules/2.6.24-19-generic/build/include/asm/atomic_32.h:5,
          à partir de /lib/modules/2.6.24-19-generic/build/include/asm/atomic.h:2,
          à partir de /lib/modules/2.6.24-19-generic/build/include/linux/proc_fs.h:8,
          à partir de rhine.h:48,
          à partir de rhine_main.c:18:
/lib/modules/2.6.24-19-generic/build/include/asm/paravirt.h:623:1: attention : « rdpmc » redéfini
Dans le fichier inclus à partir de /lib/modules/2.6.24-19-generic/build/include/asm/processor_64.h:16,
          à partir de /lib/modules/2.6.24-19-generic/build/include/asm/processor.h:4,
          à partir de /lib/modules/2.6.24-19-generic/build/include/linux/prefetch.h:14,
          à partir de /lib/modules/2.6.24-19-generic/build/include/linux/list.h:8,
          à partir de /lib/modules/2.6.24-19-generic/build/include/linux/module.h:9,
          à partir de rhine.h:23,
          à partir de rhine_main.c:18:
/lib/modules/2.6.24-19-generic/build/include/asm/msr.h:134:1: attention : ceci est la localisation d'une précédente définition
/lib/modules/2.6.24-19-generic/build/include/asm/paravirt.h:680: erreur: redefinition of «slow_down_io»
/lib/modules/2.6.24-19-generic/build/include/asm/io_64.h:44: erreur: previous definition of «slow_down_io» was here
/lib/modules/2.6.24-19-generic/build/include/asm/paravirt.h:694: erreur: conflicting types for «apic_write»
/lib/modules/2.6.24-19-generic/build/include/asm/apic_64.h:42: erreur: previous definition of «apic_write» was here
/lib/modules/2.6.24-19-generic/build/include/asm/paravirt.h:704: erreur: conflicting types for «apic_read»
/lib/modules/2.6.24-19-generic/build/include/asm/apic_64.h:47: erreur: previous definition of «apic_read» was here
/lib/modules/2.6.24-19-generic/build/include/asm/paravirt.h:913: erreur: expected «)» before «{» token
/lib/modules/2.6.24-19-generic/build/include/asm/paravirt.h:918: erreur: expected «)» before «{» token
/lib/modules/2.6.24-19-generic/build/include/asm/paravirt.h:923: erreur: expected «)» before «x»
/lib/modules/2.6.24-19-generic/build/include/asm/paravirt.h:923: erreur: expected «)» before «.» token
/lib/modules/2.6.24-19-generic/build/include/asm/paravirt.h:928: erreur: expected «)» before «x»
/lib/modules/2.6.24-19-generic/build/include/asm/paravirt.h:928: erreur: expected «)» before «.» token
/lib/modules/2.6.24-19-generic/build/include/asm/paravirt.h:934: erreur: conflicting types for «set_pte»
/lib/modules/2.6.24-19-generic/build/include/asm/pgtable_64.h:75: erreur: previous definition of «set_pte» was here
/lib/modules/2.6.24-19-generic/build/include/asm/paravirt.h:940: erreur: redefinition of «set_pte»
/lib/modules/2.6.24-19-generic/build/include/asm/paravirt.h:934: erreur: previous definition of «set_pte» was here
/lib/modules/2.6.24-19-generic/build/include/asm/paravirt.h: Dans la fonction «set_pte» :
/lib/modules/2.6.24-19-generic/build/include/asm/paravirt.h:941: erreur: «mm» undeclared (first use in this function)
/lib/modules/2.6.24-19-generic/build/include/asm/paravirt.h:941: erreur: «addr» undeclared (first use in this function)
/lib/modules/2.6.24-19-generic/build/include/asm/paravirt.h: Hors de toute fonction :
/lib/modules/2.6.24-19-generic/build/include/asm/paravirt.h:945: erreur: conflicting types for «set_pmd»
/lib/modules/2.6.24-19-generic/build/include/asm/pgtable_64.h:81: erreur: previous definition of «set_pmd» was here
Dans le fichier inclus à partir de /lib/modules/2.6.24-19-generic/build/include/asm/processor_32.h:578,
          à partir de /lib/modules/2.6.24-19-generic/build/include/asm/processor.h:2,
          à partir de /lib/modules/2.6.24-19-generic/build/include/asm/atomic_32.h:5,
          à partir de /lib/modules/2.6.24-19-generic/build/include/asm/atomic.h:2,
          à partir de /lib/modules/2.6.24-19-generic/build/include/linux/proc_fs.h:8,
          à partir de rhine.h:48,
          à partir de rhine_main.c:18:
/lib/modules/2.6.24-19-generic/build/include/asm/paravirt.h:965:49: erreur: la macro « arch_enter_lazy_cpu_mode » a reçu 1 arguments, mais elle n'en prend que 0
/lib/modules/2.6.24-19-generic/build/include/asm/paravirt.h:966: erreur: expected «=», «,», «;», «asm» or «__attribute__» before «{» token
/lib/modules/2.6.24-19-generic/build/include/asm/paravirt.h:970:49: erreur: la macro « arch_leave_lazy_cpu_mode » a reçu 1 arguments, mais elle n'en prend que 0
/lib/modules/2.6.24-19-generic/build/include/asm/paravirt.h:971: erreur: expected «=», «,», «;», «asm» or «__attribute__» before «{» token
/lib/modules/2.6.24-19-generic/build/include/asm/paravirt.h:975:49: erreur: la macro « arch_flush_lazy_cpu_mode » a reçu 1 arguments, mais elle n'en prend que 0
/lib/modules/2.6.24-19-generic/build/include/asm/paravirt.h:976: erreur: expected «=», «,», «;», «asm» or «__attribute__» before «{» token
/lib/modules/2.6.24-19-generic/build/include/asm/paravirt.h:985:49: erreur: la macro « arch_enter_lazy_mmu_mode » a reçu 1 arguments, mais elle n'en prend que 0
/lib/modules/2.6.24-19-generic/build/include/asm/paravirt.h:986: erreur: expected «=», «,», «;», «asm» or «__attribute__» before «{» token
/lib/modules/2.6.24-19-generic/build/include/asm/paravirt.h:990:49: erreur: la macro « arch_leave_lazy_mmu_mode » a reçu 1 arguments, mais elle n'en prend que 0
/lib/modules/2.6.24-19-generic/build/include/asm/paravirt.h:991: erreur: expected «=», «,», «;», «asm» or «__attribute__» before «{» token
/lib/modules/2.6.24-19-generic/build/include/asm/paravirt.h:995:49: erreur: la macro « arch_flush_lazy_mmu_mode » a reçu 1 arguments, mais elle n'en prend que 0
/lib/modules/2.6.24-19-generic/build/include/asm/paravirt.h:996: erreur: expected «=», «,», «;», «asm» or «__attribute__» before «{» token
/lib/modules/2.6.24-19-generic/build/include/asm/paravirt.h:1014: erreur: expected identifier or «(» before «void»
/lib/modules/2.6.24-19-generic/build/include/asm/paravirt.h:1014: erreur: expected «)» before numeric constant
/lib/modules/2.6.24-19-generic/build/include/asm/paravirt.h:1032: attention : conflicting types for «local_irq_restore»
/lib/modules/2.6.24-19-generic/build/include/asm/paravirt.h:1032: erreur: static declaration of «local_irq_restore» follows non-static declaration
/lib/modules/2.6.24-19-generic/build/include/linux/proportions.h:77: erreur: previous implicit declaration of «local_irq_restore» was here
/lib/modules/2.6.24-19-generic/build/include/asm/paravirt.h:1043:46: erreur: la macro « raw_local_irq_disable » a reçu 1 arguments, mais elle n'en prend que 0
/lib/modules/2.6.24-19-generic/build/include/asm/paravirt.h:1044: erreur: expected «=», «,», «;», «asm» or «__attribute__» before «{» token
/lib/modules/2.6.24-19-generic/build/include/asm/paravirt.h:1054:45: erreur: la macro « raw_local_irq_enable » a reçu 1 arguments, mais elle n'en prend que 0
/lib/modules/2.6.24-19-generic/build/include/asm/paravirt.h:1055: erreur: expected «=», «,», «;», «asm» or «__attribute__» before «{» token
Dans le fichier inclus à partir de /lib/modules/2.6.24-19-generic/build/include/asm/processor.h:2,
          à partir de /lib/modules/2.6.24-19-generic/build/include/asm/atomic_32.h:5,
          à partir de /lib/modules/2.6.24-19-generic/build/include/asm/atomic.h:2,
          à partir de /lib/modules/2.6.24-19-generic/build/include/linux/proc_fs.h:8,
          à partir de rhine.h:48,
          à partir de rhine_main.c:18:
/lib/modules/2.6.24-19-generic/build/include/asm/processor_32.h:666:1: attention : « K8_NOP1 » redéfini
Dans le fichier inclus à partir de /lib/modules/2.6.24-19-generic/build/include/asm/processor.h:4,
          à partir de /lib/modules/2.6.24-19-generic/build/include/linux/prefetch.h:14,
          à partir de /lib/modules/2.6.24-19-generic/build/include/linux/list.h:8,
          à partir de /lib/modules/2.6.24-19-generic/build/include/linux/module.h:9,
          à partir de rhine.h:23,
          à partir de rhine_main.c:18:
/lib/modules/2.6.24-19-generic/build/include/asm/processor_64.h:360:1: attention : ceci est la localisation d'une précédente définition
Dans le fichier inclus à partir de /lib/modules/2.6.24-19-generic/build/include/asm/processor.h:2,
          à partir de /lib/modules/2.6.24-19-generic/build/include/asm/atomic_32.h:5,
          à partir de /lib/modules/2.6.24-19-generic/build/include/asm/atomic.h:2,
          à partir de /lib/modules/2.6.24-19-generic/build/include/linux/proc_fs.h:8,
          à partir de rhine.h:48,
          à partir de rhine_main.c:18:
/lib/modules/2.6.24-19-generic/build/include/asm/processor_32.h:688:1: attention : « P6_NOP1 » redéfini
Dans le fichier inclus à partir de /lib/modules/2.6.24-19-generic/build/include/asm/processor.h:4,
          à partir de /lib/modules/2.6.24-19-generic/build/include/linux/prefetch.h:14,
          à partir de /lib/modules/2.6.24-19-generic/build/include/linux/list.h:8,
          à partir de /lib/modules/2.6.24-19-generic/build/include/linux/module.h:9,
          à partir de rhine.h:23,
          à partir de rhine_main.c:18:
/lib/modules/2.6.24-19-generic/build/include/asm/processor_64.h:371:1: attention : ceci est la localisation d'une précédente définition
Dans le fichier inclus à partir de /lib/modules/2.6.24-19-generic/build/include/asm/processor.h:2,
          à partir de /lib/modules/2.6.24-19-generic/build/include/asm/atomic_32.h:5,
          à partir de /lib/modules/2.6.24-19-generic/build/include/asm/atomic.h:2,
          à partir de /lib/modules/2.6.24-19-generic/build/include/linux/proc_fs.h:8,
          à partir de rhine.h:48,
          à partir de rhine_main.c:18:
/lib/modules/2.6.24-19-generic/build/include/asm/processor_32.h:727:1: attention : « ASM_NOP1 » redéfini
Dans le fichier inclus à partir de /lib/modules/2.6.24-19-generic/build/include/asm/processor.h:4,
          à partir de /lib/modules/2.6.24-19-generic/build/include/linux/prefetch.h:14,
          à partir de /lib/modules/2.6.24-19-generic/build/include/linux/list.h:8,
          à partir de /lib/modules/2.6.24-19-generic/build/include/linux/module.h:9,
          à partir de rhine.h:23,
          à partir de rhine_main.c:18:
/lib/modules/2.6.24-19-generic/build/include/asm/processor_64.h:349:1: attention : ceci est la localisation d'une précédente définition
Dans le fichier inclus à partir de /lib/modules/2.6.24-19-generic/build/include/asm/processor.h:2,
          à partir de /lib/modules/2.6.24-19-generic/build/include/asm/atomic_32.h:5,
          à partir de /lib/modules/2.6.24-19-generic/build/include/asm/atomic.h:2,
          à partir de /lib/modules/2.6.24-19-generic/build/include/linux/proc_fs.h:8,
          à partir de rhine.h:48,
          à partir de rhine_main.c:18:
/lib/modules/2.6.24-19-generic/build/include/asm/processor_32.h:728:1: attention : « ASM_NOP2 » redéfini
Dans le fichier inclus à partir de /lib/modules/2.6.24-19-generic/build/include/asm/processor.h:4,
          à partir de /lib/modules/2.6.24-19-generic/build/include/linux/prefetch.h:14,
          à partir de /lib/modules/2.6.24-19-generic/build/include/linux/list.h:8,
          à partir de /lib/modules/2.6.24-19-generic/build/include/linux/module.h:9,
          à partir de rhine.h:23,
          à partir de rhine_main.c:18:
/lib/modules/2.6.24-19-generic/build/include/asm/processor_64.h:350:1: attention : ceci est la localisation d'une précédente définition
Dans le fichier inclus à partir de /lib/modules/2.6.24-19-generic/build/include/asm/processor.h:2,
          à partir de /lib/modules/2.6.24-19-generic/build/include/asm/atomic_32.h:5,
          à partir de /lib/modules/2.6.24-19-generic/build/include/asm/atomic.h:2,
          à partir de /lib/modules/2.6.24-19-generic/build/include/linux/proc_fs.h:8,
          à partir de rhine.h:48,
          à partir de rhine_main.c:18:
/lib/modules/2.6.24-19-generic/build/include/asm/processor_32.h:729:1: attention : « ASM_NOP3 » redéfini
Dans le fichier inclus à partir de /lib/modules/2.6.24-19-generic/build/include/asm/processor.h:4,
          à partir de /lib/modules/2.6.24-19-generic/build/include/linux/prefetch.h:14,
          à partir de /lib/modules/2.6.24-19-generic/build/include/linux/list.h:8,
          à partir de /lib/modules/2.6.24-19-generic/build/include/linux/module.h:9,
          à partir de rhine.h:23,
          à partir de rhine_main.c:18:
/lib/modules/2.6.24-19-generic/build/include/asm/processor_64.h:351:1: attention : ceci est la localisation d'une précédente définition
Dans le fichier inclus à partir de /lib/modules/2.6.24-19-generic/build/include/asm/processor.h:2,
          à partir de /lib/modules/2.6.24-19-generic/build/include/asm/atomic_32.h:5,
          à partir de /lib/modules/2.6.24-19-generic/build/include/asm/atomic.h:2,
          à partir de /lib/modules/2.6.24-19-generic/build/include/linux/proc_fs.h:8,
          à partir de rhine.h:48,
          à partir de rhine_main.c:18:
/lib/modules/2.6.24-19-generic/build/include/asm/processor_32.h:730:1: attention : « ASM_NOP4 » redéfini
Dans le fichier inclus à partir de /lib/modules/2.6.24-19-generic/build/include/asm/processor.h:4,
          à partir de /lib/modules/2.6.24-19-generic/build/include/linux/prefetch.h:14,
          à partir de /lib/modules/2.6.24-19-generic/build/include/linux/list.h:8,
          à partir de /lib/modules/2.6.24-19-generic/build/include/linux/module.h:9,
          à partir de rhine.h:23,
          à partir de rhine_main.c:18:
/lib/modules/2.6.24-19-generic/build/include/asm/processor_64.h:352:1: attention : ceci est la localisation d'une précédente définition
Dans le fichier inclus à partir de /lib/modules/2.6.24-19-generic/build/include/asm/processor.h:2,
          à partir de /lib/modules/2.6.24-19-generic/build/include/asm/atomic_32.h:5,
          à partir de /lib/modules/2.6.24-19-generic/build/include/asm/atomic.h:2,
          à partir de /lib/modules/2.6.24-19-generic/build/include/linux/proc_fs.h:8,
          à partir de rhine.h:48,
          à partir de rhine_main.c:18:
/lib/modules/2.6.24-19-generic/build/include/asm/processor_32.h:731:1: attention : « ASM_NOP5 » redéfini
Dans le fichier inclus à partir de /lib/modules/2.6.24-19-generic/build/include/asm/processor.h:4,
          à partir de /lib/modules/2.6.24-19-generic/build/include/linux/prefetch.h:14,
          à partir de /lib/modules/2.6.24-19-generic/build/include/linux/list.h:8,
          à partir de /lib/modules/2.6.24-19-generic/build/include/linux/module.h:9,
          à partir de rhine.h:23,
          à partir de rhine_main.c:18:
/lib/modules/2.6.24-19-generic/build/include/asm/processor_64.h:353:1: attention : ceci est la localisation d'une précédente définition
Dans le fichier inclus à partir de /lib/modules/2.6.24-19-generic/build/include/asm/processor.h:2,
          à partir de /lib/modules/2.6.24-19-generic/build/include/asm/atomic_32.h:5,
          à partir de /lib/modules/2.6.24-19-generic/build/include/asm/atomic.h:2,
          à partir de /lib/modules/2.6.24-19-generic/build/include/linux/proc_fs.h:8,
          à partir de rhine.h:48,
          à partir de rhine_main.c:18:
/lib/modules/2.6.24-19-generic/build/include/asm/processor_32.h:732:1: attention : « ASM_NOP6 » redéfini
Dans le fichier inclus à partir de /lib/modules/2.6.24-19-generic/build/include/asm/processor.h:4,
          à partir de /lib/modules/2.6.24-19-generic/build/include/linux/prefetch.h:14,
          à partir de /lib/modules/2.6.24-19-generic/build/include/linux/list.h:8,
          à partir de /lib/modules/2.6.24-19-generic/build/include/linux/module.h:9,
          à partir de rhine.h:23,
          à partir de rhine_main.c:18:
/lib/modules/2.6.24-19-generic/build/include/asm/processor_64.h:354:1: attention : ceci est la localisation d'une précédente définition
Dans le fichier inclus à partir de /lib/modules/2.6.24-19-generic/build/include/asm/processor.h:2,
          à partir de /lib/modules/2.6.24-19-generic/build/include/asm/atomic_32.h:5,
          à partir de /lib/modules/2.6.24-19-generic/build/include/asm/atomic.h:2,
          à partir de /lib/modules/2.6.24-19-generic/build/include/linux/proc_fs.h:8,
          à partir de rhine.h:48,
          à partir de rhine_main.c:18:
/lib/modules/2.6.24-19-generic/build/include/asm/processor_32.h:733:1: attention : « ASM_NOP7 » redéfini
Dans le fichier inclus à partir de /lib/modules/2.6.24-19-generic/build/include/asm/processor.h:4,
          à partir de /lib/modules/2.6.24-19-generic/build/include/linux/prefetch.h:14,
          à partir de /lib/modules/2.6.24-19-generic/build/include/linux/list.h:8,
          à partir de /lib/modules/2.6.24-19-generic/build/include/linux/module.h:9,
          à partir de rhine.h:23,
          à partir de rhine_main.c:18:
/lib/modules/2.6.24-19-generic/build/include/asm/processor_64.h:355:1: attention : ceci est la localisation d'une précédente définition
Dans le fichier inclus à partir de /lib/modules/2.6.24-19-generic/build/include/asm/processor.h:2,
          à partir de /lib/modules/2.6.24-19-generic/build/include/asm/atomic_32.h:5,
          à partir de /lib/modules/2.6.24-19-generic/build/include/asm/atomic.h:2,
          à partir de /lib/modules/2.6.24-19-generic/build/include/linux/proc_fs.h:8,
          à partir de rhine.h:48,
          à partir de rhine_main.c:18:
/lib/modules/2.6.24-19-generic/build/include/asm/processor_32.h:734:1: attention : « ASM_NOP8 » redéfini
Dans le fichier inclus à partir de /lib/modules/2.6.24-19-generic/build/include/asm/processor.h:4,
          à partir de /lib/modules/2.6.24-19-generic/build/include/linux/prefetch.h:14,
          à partir de /lib/modules/2.6.24-19-generic/build/include/linux/list.h:8,
          à partir de /lib/modules/2.6.24-19-generic/build/include/linux/module.h:9,
          à partir de rhine.h:23,
          à partir de rhine_main.c:18:
/lib/modules/2.6.24-19-generic/build/include/asm/processor_64.h:356:1: attention : ceci est la localisation d'une précédente définition
In file included from /lib/modules/2.6.24-19-generic/build/include/asm/processor.h:2,
                 from /lib/modules/2.6.24-19-generic/build/include/asm/atomic_32.h:5,
                 from /lib/modules/2.6.24-19-generic/build/include/asm/atomic.h:2,
                 from /lib/modules/2.6.24-19-generic/build/include/linux/proc_fs.h:8,
                 from rhine.h:48,
                 from rhine_main.c:18:
/lib/modules/2.6.24-19-generic/build/include/asm/processor_32.h:746: attention : conflicting types for built-in function «__builtin_prefetch»
Dans le fichier inclus à partir de /lib/modules/2.6.24-19-generic/build/include/asm/processor.h:2,
          à partir de /lib/modules/2.6.24-19-generic/build/include/asm/atomic_32.h:5,
          à partir de /lib/modules/2.6.24-19-generic/build/include/asm/atomic.h:2,
          à partir de /lib/modules/2.6.24-19-generic/build/include/linux/proc_fs.h:8,
          à partir de rhine.h:48,
          à partir de rhine_main.c:18:
/lib/modules/2.6.24-19-generic/build/include/asm/processor_32.h:754:1: attention : « ARCH_HAS_PREFETCHW » redéfini
Dans le fichier inclus à partir de /lib/modules/2.6.24-19-generic/build/include/asm/processor.h:4,
          à partir de /lib/modules/2.6.24-19-generic/build/include/linux/prefetch.h:14,
          à partir de /lib/modules/2.6.24-19-generic/build/include/linux/list.h:8,
          à partir de /lib/modules/2.6.24-19-generic/build/include/linux/module.h:9,
          à partir de rhine.h:23,
          à partir de rhine_main.c:18:
/lib/modules/2.6.24-19-generic/build/include/asm/processor_64.h:395:1: attention : ceci est la localisation d'une précédente définition
Dans le fichier inclus à partir de /lib/modules/2.6.24-19-generic/build/include/asm/processor.h:2,
          à partir de /lib/modules/2.6.24-19-generic/build/include/asm/atomic_32.h:5,
          à partir de /lib/modules/2.6.24-19-generic/build/include/asm/atomic.h:2,
          à partir de /lib/modules/2.6.24-19-generic/build/include/linux/proc_fs.h:8,
          à partir de rhine.h:48,
          à partir de rhine_main.c:18:
/lib/modules/2.6.24-19-generic/build/include/asm/processor_32.h:755:1: attention : « ARCH_HAS_SPINLOCK_PREFETCH » redéfini
Dans le fichier inclus à partir de /lib/modules/2.6.24-19-generic/build/include/asm/processor.h:4,
          à partir de /lib/modules/2.6.24-19-generic/build/include/linux/prefetch.h:14,
          à partir de /lib/modules/2.6.24-19-generic/build/include/linux/list.h:8,
          à partir de /lib/modules/2.6.24-19-generic/build/include/linux/module.h:9,
          à partir de rhine.h:23,
          à partir de rhine_main.c:18:
/lib/modules/2.6.24-19-generic/build/include/asm/processor_64.h:404:1: attention : ceci est la localisation d'une précédente définition
/lib/modules/2.6.24-19-generic/build/include/asm/processor_32.h:760: erreur: conflicting types for «prefetchw»
/lib/modules/2.6.24-19-generic/build/include/asm/processor_64.h:397: erreur: previous definition of «prefetchw» was here
In file included from /lib/modules/2.6.24-19-generic/build/include/asm/atomic.h:2,
                 from /lib/modules/2.6.24-19-generic/build/include/linux/proc_fs.h:8,
                 from rhine.h:48,
                 from rhine_main.c:18:
/lib/modules/2.6.24-19-generic/build/include/asm/atomic_32.h:18: erreur: conflicting types for «atomic_t»
/lib/modules/2.6.24-19-generic/build/include/asm/atomic_64.h:25: erreur: previous declaration of «atomic_t» was here
/lib/modules/2.6.24-19-generic/build/include/asm/atomic_32.h:47: erreur: conflicting types for «atomic_add»
/lib/modules/2.6.24-19-generic/build/include/asm/atomic_64.h:54: erreur: previous definition of «atomic_add» was here
/lib/modules/2.6.24-19-generic/build/include/asm/atomic_32.h:62: erreur: conflicting types for «atomic_sub»
/lib/modules/2.6.24-19-generic/build/include/asm/atomic_64.h:69: erreur: previous definition of «atomic_sub» was here
/lib/modules/2.6.24-19-generic/build/include/asm/atomic_32.h:79: erreur: conflicting types for «atomic_sub_and_test»
/lib/modules/2.6.24-19-generic/build/include/asm/atomic_64.h:86: erreur: previous definition of «atomic_sub_and_test» was here
/lib/modules/2.6.24-19-generic/build/include/asm/atomic_32.h:96: erreur: conflicting types for «atomic_inc»
/lib/modules/2.6.24-19-generic/build/include/asm/atomic_64.h:103: erreur: previous definition of «atomic_inc» was here
/lib/modules/2.6.24-19-generic/build/include/asm/atomic_32.h:109: erreur: conflicting types for «atomic_dec»
/lib/modules/2.6.24-19-generic/build/include/asm/atomic_64.h:117: erreur: previous definition of «atomic_dec» was here
/lib/modules/2.6.24-19-generic/build/include/asm/atomic_32.h:124: erreur: conflicting types for «atomic_dec_and_test»
/lib/modules/2.6.24-19-generic/build/include/asm/atomic_64.h:133: erreur: previous definition of «atomic_dec_and_test» was here
/lib/modules/2.6.24-19-generic/build/include/asm/atomic_32.h:143: erreur: conflicting types for «atomic_inc_and_test»
/lib/modules/2.6.24-19-generic/build/include/asm/atomic_64.h:152: erreur: previous definition of «atomic_inc_and_test» was here
/lib/modules/2.6.24-19-generic/build/include/asm/atomic_32.h:163: erreur: conflicting types for «atomic_add_negative»
/lib/modules/2.6.24-19-generic/build/include/asm/atomic_64.h:172: erreur: previous definition of «atomic_add_negative» was here
/lib/modules/2.6.24-19-generic/build/include/asm/atomic_32.h:181: erreur: conflicting types for «atomic_add_return»
/lib/modules/2.6.24-19-generic/build/include/asm/atomic_64.h:190: erreur: previous definition of «atomic_add_return» was here
/lib/modules/2.6.24-19-generic/build/include/asm/atomic_32.h:214: erreur: conflicting types for «atomic_sub_return»
/lib/modules/2.6.24-19-generic/build/include/asm/atomic_64.h:200: erreur: previous definition of «atomic_sub_return» was here
Dans le fichier inclus à partir de /lib/modules/2.6.24-19-generic/build/include/asm/atomic.h:2,
          à partir de /lib/modules/2.6.24-19-generic/build/include/linux/proc_fs.h:8,
          à partir de rhine.h:48,
          à partir de rhine_main.c:18:
/lib/modules/2.6.24-19-generic/build/include/asm/atomic_32.h:218:1: attention : « atomic_cmpxchg » redéfini
Dans le fichier inclus à partir de /lib/modules/2.6.24-19-generic/build/include/asm/atomic.h:4,
          à partir de /lib/modules/2.6.24-19-generic/build/include/linux/spinlock.h:333,
          à partir de /lib/modules/2.6.24-19-generic/build/include/linux/seqlock.h:29,
          à partir de /lib/modules/2.6.24-19-generic/build/include/linux/time.h:8,
          à partir de /lib/modules/2.6.24-19-generic/build/include/linux/stat.h:60,
          à partir de /lib/modules/2.6.24-19-generic/build/include/linux/module.h:10,
          à partir de rhine.h:23,
          à partir de rhine_main.c:18:
/lib/modules/2.6.24-19-generic/build/include/asm/atomic_64.h:395:1: attention : ceci est la localisation d'une précédente définition
Dans le fichier inclus à partir de /lib/modules/2.6.24-19-generic/build/include/asm/atomic.h:2,
          à partir de /lib/modules/2.6.24-19-generic/build/include/linux/proc_fs.h:8,
          à partir de rhine.h:48,
          à partir de rhine_main.c:18:
/lib/modules/2.6.24-19-generic/build/include/asm/atomic_32.h:219:1: attention : « atomic_xchg » redéfini
Dans le fichier inclus à partir de /lib/modules/2.6.24-19-generic/build/include/asm/atomic.h:4,
          à partir de /lib/modules/2.6.24-19-generic/build/include/linux/spinlock.h:333,
          à partir de /lib/modules/2.6.24-19-generic/build/include/linux/seqlock.h:29,
          à partir de /lib/modules/2.6.24-19-generic/build/include/linux/time.h:8,
          à partir de /lib/modules/2.6.24-19-generic/build/include/linux/stat.h:60,
          à partir de /lib/modules/2.6.24-19-generic/build/include/linux/module.h:10,
          à partir de rhine.h:23,
          à partir de rhine_main.c:18:
/lib/modules/2.6.24-19-generic/build/include/asm/atomic_64.h:396:1: attention : ceci est la localisation d'une précédente définition
/lib/modules/2.6.24-19-generic/build/include/asm/atomic_32.h:231: erreur: conflicting types for «atomic_add_unless»
/lib/modules/2.6.24-19-generic/build/include/asm/atomic_64.h:408: erreur: previous definition of «atomic_add_unless» was here
Dans le fichier inclus à partir de /lib/modules/2.6.24-19-generic/build/include/asm/atomic.h:2,
          à partir de /lib/modules/2.6.24-19-generic/build/include/linux/proc_fs.h:8,
          à partir de rhine.h:48,
          à partir de rhine_main.c:18:
/lib/modules/2.6.24-19-generic/build/include/asm/atomic_32.h:255:1: attention : « atomic_set_mask » redéfini
Dans le fichier inclus à partir de /lib/modules/2.6.24-19-generic/build/include/asm/atomic.h:4,
          à partir de /lib/modules/2.6.24-19-generic/build/include/linux/spinlock.h:333,
          à partir de /lib/modules/2.6.24-19-generic/build/include/linux/seqlock.h:29,
          à partir de /lib/modules/2.6.24-19-generic/build/include/linux/time.h:8,
          à partir de /lib/modules/2.6.24-19-generic/build/include/linux/stat.h:60,
          à partir de /lib/modules/2.6.24-19-generic/build/include/linux/module.h:10,
          à partir de rhine.h:23,
          à partir de rhine_main.c:18:
/lib/modules/2.6.24-19-generic/build/include/asm/atomic_64.h:455:1: attention : ceci est la localisation d'une précédente définition
In file included from rhine_main.c:18:
rhine.h: Dans la fonction «rhine_disable_int» :
rhine.h:1119: attention : déclaration implicite de la fonction « «writew» »
rhine.h:1121: attention : déclaration implicite de la fonction « «writeb» »
rhine.h: Dans la fonction «reload_eeprom» :
rhine.h:1169: attention : déclaration implicite de la fonction « «readb» »
rhine.h: Dans la fonction «rhine_ReadISR» :
rhine.h:1269: attention : déclaration implicite de la fonction « «readw» »
rhine_main.c: Hors de toute fonction :
rhine_main.c:49: erreur: expected «)» before string constant
rhine_main.c:54: erreur: expected «)» before string constant
rhine_main.c:63: erreur: expected «)» before string constant
rhine_main.c:75: erreur: expected «)» before string constant
rhine_main.c:90: erreur: expected «)» before string constant
rhine_main.c:105: erreur: expected «)» before string constant
rhine_main.c:112: erreur: expected «)» before string constant
rhine_main.c:121: erreur: expected «)» before string constant
rhine_main.c:129: erreur: expected «)» before string constant
rhine_main.c:138: erreur: expected «)» before string constant
rhine_main.c:149: erreur: expected «)» before string constant
rhine_main.c:165: erreur: expected «)» before string constant
rhine_main.c:172: erreur: expected «)» before string constant
rhine_main.c:184: erreur: expected «)» before string constant
rhine_main.c:190: erreur: expected «)» before string constant
rhine_main.c: Dans la fonction «rhine_get_options» :
rhine_main.c:367: attention : déréférencement du pointeur type-punned brisera les strictes d'aliases
rhine_main.c: Dans la fonction «rhine_init_registers» :
rhine_main.c:518: attention : déclaration implicite de la fonction « «writel» »
rhine_main.c: Dans la fonction «rhine_found1» :
rhine_main.c:596: attention : déclaration implicite de la fonction « «init_etherdev» »
rhine_main.c:596: attention : assignment makes pointer from integer without a cast
rhine_main.c:634: attention : déclaration implicite de la fonction « «ioremap» »
rhine_main.c:634: attention : assignment makes pointer from integer without a cast
rhine_main.c: Dans la fonction «rhine_free_info» :
rhine_main.c:830: attention : déclaration implicite de la fonction « «iounmap» »
rhine_main.c: Dans la fonction «rhine_receive_frame» :
rhine_main.c:1204: erreur: «struct sk_buff» has no member named «mac»
rhine_main.c:1204: erreur: «struct sk_buff» has no member named «mac»
rhine_main.c:1204: erreur: «struct sk_buff» has no member named «mac»
rhine_main.c:1204: erreur: «struct sk_buff» has no member named «mac»
rhine_main.c: Dans la fonction «rhine_alloc_rx_buf» :
rhine_main.c:1245: attention : passing argument 2 of «pci_map_single» makes pointer from integer without a cast
rhine_main.c: Dans la fonction «rhine_open» :
rhine_main.c:1567: erreur: «SA_SHIRQ» undeclared (first use in this function)
rhine_main.c:1567: attention : passing argument 2 of «request_irq» from incompatible pointer type
rhine_main.c: Dans la fonction «rhine_xmit» :
rhine_main.c:1708: erreur: «CHECKSUM_HW» undeclared (first use in this function)
rhine_main.c:1709: erreur: «struct sk_buff» has no member named «nh»
rhine_main.c: Dans la fonction «rhine_get_cam_mask» :
rhine_main.c:1797: attention : déclaration implicite de la fonction « «readl» »
rhine_main.c: Hors de toute fonction :
rhine_main.c:1996: attention : initialization from incompatible pointer type
rhine_main.c: Dans la fonction «rhine_init_module» :
rhine_main.c:2005: attention : déclaration implicite de la fonction « «pci_module_init» »
rhine_main.c: Dans la fonction «mii_get_phy_id» :
rhine_main.c:2230: attention : déréférencement du pointeur type-punned brisera les strictes d'aliases
rhine_main.c:2231: attention : déréférencement du pointeur type-punned brisera les strictes d'aliases
rhine_main.c: Dans la fonction «rhine_ethtool_ioctl» :
rhine_main.c:2671: erreur: «struct pci_dev» has no member named «slot_name»
rhine_main.c: Dans la fonction «rhine_mii_ioctl» :
rhine_main.c:2780: attention : déréférencement du pointeur type-punned brisera les strictes d'aliases
rhine_main.c: Dans la fonction «rhine_notify_reboot» :
rhine_main.c:2821: attention : déclaration implicite de la fonction « «pci_for_each_dev» »
rhine_main.c:2821: erreur: expected «;» before «{» token
rhine_main.c: Dans la fonction «rhine_suspend» :
rhine_main.c:2838: erreur: trop d'arguments pour la fonction «pci_save_state»
rhine_main.c: Dans la fonction «rhine_resume» :
rhine_main.c:2868: erreur: trop d'arguments pour la fonction «pci_restore_state»
make: *** [rhine_main.o] Erreur 1

merci pour votre aide !

#22 -1 »  Dossier de configuration dans /home » Le 30/09/2008, à 04:12

kelk'1
Réponses : 2

bonjour,
moi j'ai réinstallé ubuntu en laissant ma /home
et maintenant je veux connaitre quels sont les dossiers cachés a ne pas effacer ( biensur celui de firefox et ceux de mes parametres perso ) donc si vous pouviez me dire lequels servent a enregistrer mes parametres comme ca j'effacerais tous les autres ( .config , .gnome ... ?????)
merci

#23 -1 »  [Résolu]Probleme soudain de son sur les vidéos » Le 18/09/2008, à 01:12

kelk'1
Réponses : 1

Bonjour,
tout allait bien dans le meilleur des mondes quand tout d'un coup, je n'arrivait plus a lire un fichier avec gedit ou ouvrir de console (elle s'ouvre mais ne réponds pas) (ouais c'est bizzare je sais ) , en plus de ca, plus de son du tout, ni des videos , ni des applications, nada. je décide donc de rebooter pour voir ce que ca donne (ouais je sais , une vieille habitude de windowsien !) , tout rentre en ordre sauf une chose : le son sur les videos ne marche plus ! (il marche tres bien partout ailleurs)
je n'ai aucune idée de ce qui est arrivé, mais je n'ai rien installé qui puisse faire ca, et aucune de mes installations ne datais de moins d'un jour
je compte sur votre aide
merci d'avance

je suis sous Ubuntu 8.04

#24 Re : -1 »  [Résolu]Probleme soudain de son sur les vidéos » Le 18/09/2008, à 01:15

kelk'1
Réponses : 1

bon j'ai décidé de re-rebooter
et tadaaa
ca remarche comme par magie
heureusement que j'ai été sous windows avant tongue

si quelqu'un a quend même une idée de ce qui pourrait faire planter la console, je suis preneur !