Contenu | Rechercher | Menus

Annonce

Si vous rencontrez des soucis à rester connecté sur le forum (ou si vous avez perdu votre mot de passe) déconnectez-vous et reconnectez-vous depuis cette page, en cochant la case "Me connecter automatiquement lors de mes prochaines visites". Attention, le forum rencontre actuellement quelques difficultés. En cas d'erreur 502, il ne faut pas re-valider l'envoi d'un message ou l'ouverture d'une discussion, au risque de créer un doublon.

La section divers se réorganise ! De nouvelles sous-sections à venir. (plus d'infos + donner son avis)

nombre réponses : 25

#0 -1 »  temoignage epson stylus sx400 » Le 10/10/2009, à 13:09

richon
Réponses : 41

bonjour, au depart j'avais acheté une HP deskjet F4580. Le probleme c'est qu'elle est trop recente et donc HPLIP ne la suportait pas encore par contre hpijs oui mais donc seul l'imprimante fonctionne . Sur le forum de HPLIP on ma repondu que normalement la prochaine version la suportera.
Je suis donc retourné a darty pour l'echanger. J'ai donc pris une epson stylus sx400 edition wifi pour 5 euro de plus.

deja je la trouve plus sympa avec son petit ecran. l'ecran et en faite bien pratique pour naviguer et utiliser sans le pc allumé l'imprimante (ou là le photocopieur).
elle fait moins de bruit et elle a 4 cartouches separées, c'est plus economique mais bon je ne suis pas là pour faire la pub pour cette imprimante mais je donne mon avis, pour moi elle est mieux que la HP deskjet F4580.

je vous donne ce que j'ai fait pour que tout marche en usb (pas encore essayé le serveur d'impression fourni avec)

je suis sous ubuntu 9.04

IMPRIMANTE
elle est directement reconnue pas besoin d'installer un pilote ou quoi que ce sois.

dans syteme/administration/impression quand je regarde les propriétés de mon imprimante elle est installé avec CUPS+Gutenprint v5.2.3 automatiquement.


SCANER
regarder là

http://doc.ubuntu-fr.org/imprimante_epson_multifonctions#configuration_du_scanner

à configuration du scaner

faire ce qui est ecrit pour changer le fichier
/etc/sane.d/epson.conf

de là xsane reconnait le scaner que si on lance xsane en mode root=> sudo xsane

si a ce stade sudo xsane ne voit pas votre scaner installer le paquet libsane-extras (pour utiliser le pilote epkowa mais chez moi pas besoin il utilise naturellement un pilote epson)

quand je lance sudo xsane j'ai aussi mes deux cartes video en proposition. pour les enlever de la proposition, editer

sudo gedit /etc/sane.d/dll.conf  et mettre en commentaire la ligne v4l ( mettre un # devant)


pour que xsane marche sans le sudo

sudo gedit /lib/udev/rules.d/50-udev-default.rules (attention pour les versions plus ancienne que 9.04 le fichier peut etre "40-basic-permissions.rules" qui se trouve dans /etc/udev/rules.d/)

a la ligne # libusb device nodes  remplacer 0664 par 0666

on obtient:

# libusb device nodes
SUBSYSTEM=="usb", ENV{DEVTYPE}=="usb_device", NAME="bus/usb/$env{BUSNUM}/$env{DEVNUM}", MODE="0666"

redamerer l'ordi

a ce stade j'ai "erreur de création de fichier permission non accordé" au demarage de xsane et j'ai trois fois ce message quand je ferme xsane

pour cela faire
sudo chmod -R 777 ~/.sane/

ou
sudo chmod 777 ~/.sane/
puis
sudo chmod 777 ~/.sane/xsane/
puis
sudo chmod 777 ~/.sane/xsane/*

et voila tout marche enfin chez moi

#1 Re : -1 »  temoignage epson stylus sx400 » Le 23/01/2010, à 18:02

richon
Réponses : 41

oui c 'est different avec 9.10 que 9.04 et c'est dommage

#2 -1 »  [HPLIP] deskjet F4580 » Le 04/10/2009, à 14:57

richon
Réponses : 7

bonjour
je suis sous ubuntu 9.04

j'ai acheté la HP deskjet F4580 wifi.
dans un premier temps je cherche a la faire fonctionner avec l'usb

1- j'ai branché mon imprimante sur l'usb alumé l'imprimante et ubuntu a reconnu qu'il se passé qq chose car l'icone bleu HP et apparu ds la barre et j'ai les fenetre d'instalation d'imprimante qui se son ouvertes.
j'ai configuré mon imprimante ubuntu a installé le driver automatiquement.
je pense qu'il a installé hpjip. de la fenetre /systeme/administration/impression, je vois bien mon imprimante la page teste s'imprime avec succes.
de la j'ouvre une page web je clique sur imprimer et ca fonctioonne.

de là je me dit que hpijs c'est juste pour imprimer donc si je veux mon scaner il faut HPLIP

2- je clique sur l'icone bleu HPLIP et il me di de lancer HPLIP-setup je crois.

je le lance, je choisi connection usb et là il me dit device not found

3- je suis a la letre le tuto de   pierguiard  * Installation de HPLIP 3.9.X sous 8.10 et 9.04

tout se derouule bien a la fin la fenetre hplip setup s'ouvre je choisi usb et rebelote il me dit device not found
donc là je sais plus trop quoi faire donc je demande votre aide

en gros hpijs marche pour mon imprimante mais peut etre pas HPLIP mais se serait bizare

si qq'un a une idée

#3 Re : -1 »  [HPLIP] deskjet F4580 » Le 04/10/2009, à 14:59

richon
Réponses : 7

faut 'il que j'enleve mon imprimante dans /systeme/administration/impression car avec le tuto de pierguiard j'ai enlevé hplip dans synaptique et donc hpijs et donc là meme en imprimante seul elle ne fonctionne plus

#4 Re : -1 »  [HPLIP] deskjet F4580 » Le 11/10/2009, à 11:02

richon
Réponses : 7

merci mais deja suivi le tuto et HPLIP ne suporte pas cette imprimante trop recente j'ai donc changé d'imprimante

#5 -1 »  epson stylus sx400 » Le 06/10/2009, à 13:58

richon
Réponses : 2

je voudrais juste savoir si l'imprimante epson stylus sx 400 edition wifi est instalable sous ubuntu 9.04
pour le moment je veux juste savoir si elle est compatible au niveau de l'usb. le wifi je verrais plus tard

si elle est compatible pouvez vous me dire le driver a utiliser merci beaucoup

#6 Re : -1 »  epson stylus sx400 » Le 10/10/2009, à 12:45

richon
Réponses : 2

ok merci j'ai reussi à installer l'imprimante et le scaner en usb tout marche

pour savoir ce que j'ai fait eller voir mon poste : temoignage epson sx400

#7 -1 »  [HPLIP]imprimante wifi » Le 28/09/2009, à 14:12

richon
Réponses : 5

bonjour, je vais acheter une imprimante wifi et avant je voudrai avoir votre avis sur deux imprimantes

Epson stylux sx 400 wifi et HP photosmart c4580

sont elles reconnues sous ubuntu, j'ai 9.04 ?

je vous remercie

#8 Re : -1 »  [HPLIP]imprimante wifi » Le 28/09/2009, à 16:06

richon
Réponses : 5

ok c'est noté merci, je vais surement prendre celle là en plus HP c'est pas mal compatible
merci

#9 -1 »  nfs undercover » Le 20/07/2009, à 14:22

richon
Réponses : 1

bonjour,

j'ai installé need for speed undercorver a l'aide de play on linux. Quand je lance le jeu installé j'ai un ecran tout noir et obligé de faire alt F4

ma config

ubuntu 8.10
1.5G de ram
P4 2GHz
nvidia G force FX5500  256MB

voila ce que me dit le terminal

flo@zigzag:~/.PlayOnLinux/wineprefix/NeedForSpeedUndercover/drive_c/Program Files/EA Games/Need for Speed Undercover$ wine nfs.exe 
err:alsa:ALSA_CheckSetVolume Could not find 'PCM Playback Volume' element
err:alsa:ALSA_CheckSetVolume Could not find 'PCM Playback Volume' element
fixme:mixer:ALSA_MixerInit No master control found on Brooktree Bt878, disabling mixer
fixme:mixer:ALSA_MixerInit No master control found on SAA7134, disabling mixer
fixme:ntdll:NtQueryInformationProcess (0xffffffff,info_class=34,0x236aa0c,0x00000004,0x236aa08) Unknown information class
fixme:ntdll:NtQuerySystemInformation info_class SYSTEM_HANDLE_INFORMATION
fixme:ntdll:NtQueryObject Unsupported information class 3
fixme:debugstr:CheckRemoteDebuggerPresent (0xffffffff)->(0x23697f8): Stub!
err:rpc:I_RpcGetBuffer no binding
fixme:ntdll:NtQueryInformationProcess (process=0xffffffff) Unimplemented information class: ProcessDebugFlags
fixme:win:EnumDisplayDevicesW ((null),0,0x2369654,0x00000000), stub!
fixme:win:EnumDisplayDevicesW ((null),0,0x23691d4,0x00000000), stub!
fixme:psapi:EnumPageFilesA (0x17e1f40, 0x2348adc) stub
fixme:psapi:EnumPageFilesA (0x17e1f40, 0x23133f8) stub
fixme:win:EnumDisplayDevicesW ((null),0,0x22af5cc,0x00000000), stub!
fixme:win:EnumDisplayDevicesW ((null),0,0x22af14c,0x00000000), stub!
fixme:win:EnumDisplayDevicesW ((null),0,0x22aee90,0x00000000), stub!
fixme:win:EnumDisplayDevicesW ((null),0,0x22aea10,0x00000000), stub!
fixme:win:EnumDisplayDevicesW ((null),0,0x22af5d0,0x00000000), stub!
fixme:win:EnumDisplayDevicesW ((null),0,0x22af150,0x00000000), stub!
fixme:ntdll:NtQueryInformationProcess (process=0xffffffff) Unimplemented information class: ProcessDeviceMap
fixme:ntdll:NtQuerySystemInformation info_class SYSTEM_HANDLE_INFORMATION
fixme:ntdll:NtQueryObject Unsupported information class 3
fixme:debugstr:CheckRemoteDebuggerPresent (0xffffffff)->(0x237f894): Stub!
err:rpc:I_RpcGetBuffer no binding
fixme:ntdll:NtQueryInformationProcess (process=0xffffffff) Unimplemented information class: ProcessDebugFlags
fixme:thread:SetThreadIdealProcessor (0x74c): stub
fixme:thread:SetThreadIdealProcessor (0x74c): stub
fixme:thread:SetThreadIdealProcessor (0x818): stub
fixme:thread:SetThreadIdealProcessor (0x81c): stub
fixme:thread:SetThreadIdealProcessor (0x824): stub
fixme:win:EnumDisplayDevicesW ((null),0,0x8ebe444,0x00000000), stub!
fixme:system:SystemParametersInfoW Unimplemented action: 59 (SPI_SETSTICKYKEYS)
fixme:system:SystemParametersInfoW Unimplemented action: 53 (SPI_SETTOGGLEKEYS)
fixme:system:SystemParametersInfoW Unimplemented action: 51 (SPI_SETFILTERKEYS)
err:d3d:getColorBits Unsupported format: WINED3DFMT_R32_FLOAT
err:d3d:IWineD3DImpl_IsPixelFormatCompatibleWithRenderFmt Unable to check compatibility for Format=WINED3DFMT_R32_FLOAT
err:d3d:getColorBits Unsupported format: WINED3DFMT_R32_FLOAT
err:d3d:IWineD3DImpl_IsPixelFormatCompatibleWithRenderFmt Unable to check compatibility for Format=WINED3DFMT_R32_FLOAT
err:d3d:getColorBits Unsupported format: WINED3DFMT_R32_FLOAT
err:d3d:IWineD3DImpl_IsPixelFormatCompatibleWithRenderFmt Unable to check compatibility for Format=WINED3DFMT_R32_FLOAT
err:d3d:getColorBits Unsupported format: WINED3DFMT_R32_FLOAT
err:d3d:IWineD3DImpl_IsPixelFormatCompatibleWithRenderFmt Unable to check compatibility for Format=WINED3DFMT_R32_FLOAT
err:d3d:getColorBits Unsupported format: WINED3DFMT_R32_FLOAT
err:d3d:IWineD3DImpl_IsPixelFormatCompatibleWithRenderFmt Unable to check compatibility for Format=WINED3DFMT_R32_FLOAT
err:d3d:getColorBits Unsupported format: WINED3DFMT_R32_FLOAT
err:d3d:IWineD3DImpl_IsPixelFormatCompatibleWithRenderFmt Unable to check compatibility for Format=WINED3DFMT_R32_FLOAT
err:d3d:getColorBits Unsupported format: WINED3DFMT_R32_FLOAT
err:d3d:IWineD3DImpl_IsPixelFormatCompatibleWithRenderFmt Unable to check compatibility for Format=WINED3DFMT_R32_FLOAT
err:d3d:getColorBits Unsupported format: WINED3DFMT_R32_FLOAT
err:d3d:IWineD3DImpl_IsPixelFormatCompatibleWithRenderFmt Unable to check compatibility for Format=WINED3DFMT_R32_FLOAT
err:d3d:getColorBits Unsupported format: WINED3DFMT_R32_FLOAT
err:d3d:IWineD3DImpl_IsPixelFormatCompatibleWithRenderFmt Unable to check compatibility for Format=WINED3DFMT_R32_FLOAT
err:d3d:getColorBits Unsupported format: WINED3DFMT_R32_FLOAT
err:d3d:IWineD3DImpl_IsPixelFormatCompatibleWithRenderFmt Unable to check compatibility for Format=WINED3DFMT_R32_FLOAT
err:d3d:getColorBits Unsupported format: WINED3DFMT_R32_FLOAT
err:d3d:IWineD3DImpl_IsPixelFormatCompatibleWithRenderFmt Unable to check compatibility for Format=WINED3DFMT_R32_FLOAT
err:d3d:getColorBits Unsupported format: WINED3DFMT_R32_FLOAT
err:d3d:IWineD3DImpl_IsPixelFormatCompatibleWithRenderFmt Unable to check compatibility for Format=WINED3DFMT_R32_FLOAT
err:d3d:getColorBits Unsupported format: WINED3DFMT_R32_FLOAT
err:d3d:IWineD3DImpl_IsPixelFormatCompatibleWithRenderFmt Unable to check compatibility for Format=WINED3DFMT_R32_FLOAT
err:d3d:getColorBits Unsupported format: WINED3DFMT_R32_FLOAT
err:d3d:IWineD3DImpl_IsPixelFormatCompatibleWithRenderFmt Unable to check compatibility for Format=WINED3DFMT_R32_FLOAT
err:d3d:getColorBits Unsupported format: WINED3DFMT_R32_FLOAT
err:d3d:IWineD3DImpl_IsPixelFormatCompatibleWithRenderFmt Unable to check compatibility for Format=WINED3DFMT_R32_FLOAT
err:d3d:getColorBits Unsupported format: WINED3DFMT_R32_FLOAT
err:d3d:IWineD3DImpl_IsPixelFormatCompatibleWithRenderFmt Unable to check compatibility for Format=WINED3DFMT_R32_FLOAT
err:d3d:getColorBits Unsupported format: WINED3DFMT_R32_FLOAT
err:d3d:IWineD3DImpl_IsPixelFormatCompatibleWithRenderFmt Unable to check compatibility for Format=WINED3DFMT_R32_FLOAT
err:d3d:getColorBits Unsupported format: WINED3DFMT_R32_FLOAT
err:d3d:IWineD3DImpl_IsPixelFormatCompatibleWithRenderFmt Unable to check compatibility for Format=WINED3DFMT_R32_FLOAT
err:d3d:getColorBits Unsupported format: WINED3DFMT_R32_FLOAT
err:d3d:IWineD3DImpl_IsPixelFormatCompatibleWithRenderFmt Unable to check compatibility for Format=WINED3DFMT_R32_FLOAT
err:d3d:getColorBits Unsupported format: WINED3DFMT_R32_FLOAT
err:d3d:IWineD3DImpl_IsPixelFormatCompatibleWithRenderFmt Unable to check compatibility for Format=WINED3DFMT_R32_FLOAT
err:d3d:getColorBits Unsupported format: WINED3DFMT_R32_FLOAT
err:d3d:IWineD3DImpl_IsPixelFormatCompatibleWithRenderFmt Unable to check compatibility for Format=WINED3DFMT_R32_FLOAT
err:d3d:getColorBits Unsupported format: WINED3DFMT_R32_FLOAT
err:d3d:IWineD3DImpl_IsPixelFormatCompatibleWithRenderFmt Unable to check compatibility for Format=WINED3DFMT_R32_FLOAT
err:d3d:getColorBits Unsupported format: WINED3DFMT_R32_FLOAT
err:d3d:IWineD3DImpl_IsPixelFormatCompatibleWithRenderFmt Unable to check compatibility for Format=WINED3DFMT_R32_FLOAT
err:d3d:getColorBits Unsupported format: WINED3DFMT_R32_FLOAT
err:d3d:IWineD3DImpl_IsPixelFormatCompatibleWithRenderFmt Unable to check compatibility for Format=WINED3DFMT_R32_FLOAT
err:d3d:getColorBits Unsupported format: WINED3DFMT_R32_FLOAT
err:d3d:IWineD3DImpl_IsPixelFormatCompatibleWithRenderFmt Unable to check compatibility for Format=WINED3DFMT_R32_FLOAT
err:d3d:getColorBits Unsupported format: WINED3DFMT_R32_FLOAT
err:d3d:IWineD3DImpl_IsPixelFormatCompatibleWithRenderFmt Unable to check compatibility for Format=WINED3DFMT_R32_FLOAT
err:d3d:getColorBits Unsupported format: WINED3DFMT_R32_FLOAT
err:d3d:IWineD3DImpl_IsPixelFormatCompatibleWithRenderFmt Unable to check compatibility for Format=WINED3DFMT_R32_FLOAT
err:d3d:getColorBits Unsupported format: WINED3DFMT_R32_FLOAT
err:d3d:IWineD3DImpl_IsPixelFormatCompatibleWithRenderFmt Unable to check compatibility for Format=WINED3DFMT_R32_FLOAT
err:d3d:getColorBits Unsupported format: WINED3DFMT_R32_FLOAT
err:d3d:IWineD3DImpl_IsPixelFormatCompatibleWithRenderFmt Unable to check compatibility for Format=WINED3DFMT_R32_FLOAT
err:d3d:getColorBits Unsupported format: WINED3DFMT_R32_FLOAT
err:d3d:IWineD3DImpl_IsPixelFormatCompatibleWithRenderFmt Unable to check compatibility for Format=WINED3DFMT_R32_FLOAT
err:d3d:getColorBits Unsupported format: WINED3DFMT_R32_FLOAT
err:d3d:IWineD3DImpl_IsPixelFormatCompatibleWithRenderFmt Unable to check compatibility for Format=WINED3DFMT_R32_FLOAT
err:d3d:getColorBits Unsupported format: WINED3DFMT_R32_FLOAT
err:d3d:IWineD3DImpl_IsPixelFormatCompatibleWithRenderFmt Unable to check compatibility for Format=WINED3DFMT_R32_FLOAT
err:d3d:getColorBits Unsupported format: WINED3DFMT_R32_FLOAT
err:d3d:IWineD3DImpl_IsPixelFormatCompatibleWithRenderFmt Unable to check compatibility for Format=WINED3DFMT_R32_FLOAT
err:d3d:getColorBits Unsupported format: WINED3DFMT_R32_FLOAT
err:d3d:IWineD3DImpl_IsPixelFormatCompatibleWithRenderFmt Unable to check compatibility for Format=WINED3DFMT_R32_FLOAT
err:d3d:getColorBits Unsupported format: WINED3DFMT_R32_FLOAT
err:d3d:IWineD3DImpl_IsPixelFormatCompatibleWithRenderFmt Unable to check compatibility for Format=WINED3DFMT_R32_FLOAT
err:d3d:getColorBits Unsupported format: WINED3DFMT_R32_FLOAT
err:d3d:IWineD3DImpl_IsPixelFormatCompatibleWithRenderFmt Unable to check compatibility for Format=WINED3DFMT_R32_FLOAT
err:d3d:getColorBits Unsupported format: WINED3DFMT_R32_FLOAT
err:d3d:IWineD3DImpl_IsPixelFormatCompatibleWithRenderFmt Unable to check compatibility for Format=WINED3DFMT_R32_FLOAT
err:d3d:getColorBits Unsupported format: WINED3DFMT_R32_FLOAT
err:d3d:IWineD3DImpl_IsPixelFormatCompatibleWithRenderFmt Unable to check compatibility for Format=WINED3DFMT_R32_FLOAT
err:d3d:getColorBits Unsupported format: WINED3DFMT_R32_FLOAT
err:d3d:IWineD3DImpl_IsPixelFormatCompatibleWithRenderFmt Unable to check compatibility for Format=WINED3DFMT_R32_FLOAT
err:d3d:getColorBits Unsupported format: WINED3DFMT_R32_FLOAT
err:d3d:IWineD3DImpl_IsPixelFormatCompatibleWithRenderFmt Unable to check compatibility for Format=WINED3DFMT_R32_FLOAT
err:d3d:getColorBits Unsupported format: WINED3DFMT_R32_FLOAT
err:d3d:IWineD3DImpl_IsPixelFormatCompatibleWithRenderFmt Unable to check compatibility for Format=WINED3DFMT_R32_FLOAT
err:d3d:getColorBits Unsupported format: WINED3DFMT_R32_FLOAT
err:d3d:IWineD3DImpl_IsPixelFormatCompatibleWithRenderFmt Unable to check compatibility for Format=WINED3DFMT_R32_FLOAT
err:d3d:getColorBits Unsupported format: WINED3DFMT_R32_FLOAT
err:d3d:IWineD3DImpl_IsPixelFormatCompatibleWithRenderFmt Unable to check compatibility for Format=WINED3DFMT_R32_FLOAT
err:d3d:getColorBits Unsupported format: WINED3DFMT_R32_FLOAT
err:d3d:IWineD3DImpl_IsPixelFormatCompatibleWithRenderFmt Unable to check compatibility for Format=WINED3DFMT_R32_FLOAT
err:d3d:getColorBits Unsupported format: WINED3DFMT_R32_FLOAT
err:d3d:IWineD3DImpl_IsPixelFormatCompatibleWithRenderFmt Unable to check compatibility for Format=WINED3DFMT_R32_FLOAT
err:d3d:getColorBits Unsupported format: WINED3DFMT_R32_FLOAT
err:d3d:IWineD3DImpl_IsPixelFormatCompatibleWithRenderFmt Unable to check compatibility for Format=WINED3DFMT_R32_FLOAT
err:d3d:getColorBits Unsupported format: WINED3DFMT_R32_FLOAT
err:d3d:IWineD3DImpl_IsPixelFormatCompatibleWithRenderFmt Unable to check compatibility for Format=WINED3DFMT_R32_FLOAT
err:d3d:getColorBits Unsupported format: WINED3DFMT_R32_FLOAT
err:d3d:IWineD3DImpl_IsPixelFormatCompatibleWithRenderFmt Unable to check compatibility for Format=WINED3DFMT_R32_FLOAT
err:d3d:getColorBits Unsupported format: WINED3DFMT_R32_FLOAT
err:d3d:IWineD3DImpl_IsPixelFormatCompatibleWithRenderFmt Unable to check compatibility for Format=WINED3DFMT_R32_FLOAT
err:d3d:getColorBits Unsupported format: WINED3DFMT_R32_FLOAT
err:d3d:IWineD3DImpl_IsPixelFormatCompatibleWithRenderFmt Unable to check compatibility for Format=WINED3DFMT_R32_FLOAT
err:d3d:getColorBits Unsupported format: WINED3DFMT_R32_FLOAT
err:d3d:IWineD3DImpl_IsPixelFormatCompatibleWithRenderFmt Unable to check compatibility for Format=WINED3DFMT_R32_FLOAT
err:d3d:getColorBits Unsupported format: WINED3DFMT_R32_FLOAT
err:d3d:IWineD3DImpl_IsPixelFormatCompatibleWithRenderFmt Unable to check compatibility for Format=WINED3DFMT_R32_FLOAT
err:d3d:getColorBits Unsupported format: WINED3DFMT_R32_FLOAT
err:d3d:IWineD3DImpl_IsPixelFormatCompatibleWithRenderFmt Unable to check compatibility for Format=WINED3DFMT_R32_FLOAT
err:d3d:getColorBits Unsupported format: WINED3DFMT_R32_FLOAT
err:d3d:IWineD3DImpl_IsPixelFormatCompatibleWithRenderFmt Unable to check compatibility for Format=WINED3DFMT_R32_FLOAT
err:d3d:getColorBits Unsupported format: WINED3DFMT_R32_FLOAT
err:d3d:IWineD3DImpl_IsPixelFormatCompatibleWithRenderFmt Unable to check compatibility for Format=WINED3DFMT_R32_FLOAT
err:d3d:getColorBits Unsupported format: WINED3DFMT_R32_FLOAT
err:d3d:IWineD3DImpl_IsPixelFormatCompatibleWithRenderFmt Unable to check compatibility for Format=WINED3DFMT_R32_FLOAT
err:d3d:getColorBits Unsupported format: WINED3DFMT_R32_FLOAT
err:d3d:IWineD3DImpl_IsPixelFormatCompatibleWithRenderFmt Unable to check compatibility for Format=WINED3DFMT_R32_FLOAT
err:d3d:getColorBits Unsupported format: WINED3DFMT_R32_FLOAT
err:d3d:IWineD3DImpl_IsPixelFormatCompatibleWithRenderFmt Unable to check compatibility for Format=WINED3DFMT_R32_FLOAT
err:d3d:getColorBits Unsupported format: WINED3DFMT_R32_FLOAT
err:d3d:IWineD3DImpl_IsPixelFormatCompatibleWithRenderFmt Unable to check compatibility for Format=WINED3DFMT_R32_FLOAT
err:d3d:getColorBits Unsupported format: WINED3DFMT_R32_FLOAT
err:d3d:IWineD3DImpl_IsPixelFormatCompatibleWithRenderFmt Unable to check compatibility for Format=WINED3DFMT_R32_FLOAT
err:d3d:getColorBits Unsupported format: WINED3DFMT_R32_FLOAT
err:d3d:IWineD3DImpl_IsPixelFormatCompatibleWithRenderFmt Unable to check compatibility for Format=WINED3DFMT_R32_FLOAT
err:d3d:getColorBits Unsupported format: WINED3DFMT_R32_FLOAT
err:d3d:IWineD3DImpl_IsPixelFormatCompatibleWithRenderFmt Unable to check compatibility for Format=WINED3DFMT_R32_FLOAT
err:d3d:getColorBits Unsupported format: WINED3DFMT_R32_FLOAT
err:d3d:IWineD3DImpl_IsPixelFormatCompatibleWithRenderFmt Unable to check compatibility for Format=WINED3DFMT_R32_FLOAT
err:d3d:getColorBits Unsupported format: WINED3DFMT_R32_FLOAT
err:d3d:IWineD3DImpl_IsPixelFormatCompatibleWithRenderFmt Unable to check compatibility for Format=WINED3DFMT_R32_FLOAT
err:d3d:getColorBits Unsupported format: WINED3DFMT_R32_FLOAT
err:d3d:IWineD3DImpl_IsPixelFormatCompatibleWithRenderFmt Unable to check compatibility for Format=WINED3DFMT_R32_FLOAT
err:d3d:getColorBits Unsupported format: WINED3DFMT_R32_FLOAT
err:d3d:IWineD3DImpl_IsPixelFormatCompatibleWithRenderFmt Unable to check compatibility for Format=WINED3DFMT_R32_FLOAT
err:d3d:getColorBits Unsupported format: WINED3DFMT_R32_FLOAT
err:d3d:IWineD3DImpl_IsPixelFormatCompatibleWithRenderFmt Unable to check compatibility for Format=WINED3DFMT_R32_FLOAT
err:d3d:getColorBits Unsupported format: WINED3DFMT_R32_FLOAT
err:d3d:IWineD3DImpl_IsPixelFormatCompatibleWithRenderFmt Unable to check compatibility for Format=WINED3DFMT_R32_FLOAT
err:d3d:getColorBits Unsupported format: WINED3DFMT_R32_FLOAT
err:d3d:IWineD3DImpl_IsPixelFormatCompatibleWithRenderFmt Unable to check compatibility for Format=WINED3DFMT_R32_FLOAT
err:d3d:getColorBits Unsupported format: WINED3DFMT_R32_FLOAT
err:d3d:IWineD3DImpl_IsPixelFormatCompatibleWithRenderFmt Unable to check compatibility for Format=WINED3DFMT_R32_FLOAT
err:d3d:getColorBits Unsupported format: WINED3DFMT_R32_FLOAT
err:d3d:IWineD3DImpl_IsPixelFormatCompatibleWithRenderFmt Unable to check compatibility for Format=WINED3DFMT_R32_FLOAT
err:d3d:getColorBits Unsupported format: WINED3DFMT_R32_FLOAT
err:d3d:IWineD3DImpl_IsPixelFormatCompatibleWithRenderFmt Unable to check compatibility for Format=WINED3DFMT_R32_FLOAT
err:d3d:getColorBits Unsupported format: WINED3DFMT_R32_FLOAT
err:d3d:IWineD3DImpl_IsPixelFormatCompatibleWithRenderFmt Unable to check compatibility for Format=WINED3DFMT_R32_FLOAT
err:d3d:getColorBits Unsupported format: WINED3DFMT_R32_FLOAT
err:d3d:IWineD3DImpl_IsPixelFormatCompatibleWithRenderFmt Unable to check compatibility for Format=WINED3DFMT_R32_FLOAT
err:d3d:getColorBits Unsupported format: WINED3DFMT_R32_FLOAT
err:d3d:IWineD3DImpl_IsPixelFormatCompatibleWithRenderFmt Unable to check compatibility for Format=WINED3DFMT_R32_FLOAT
err:d3d:getColorBits Unsupported format: WINED3DFMT_R32_FLOAT
err:d3d:IWineD3DImpl_IsPixelFormatCompatibleWithRenderFmt Unable to check compatibility for Format=WINED3DFMT_R32_FLOAT
err:d3d:getColorBits Unsupported format: WINED3DFMT_R32_FLOAT
err:d3d:IWineD3DImpl_IsPixelFormatCompatibleWithRenderFmt Unable to check compatibility for Format=WINED3DFMT_R32_FLOAT
err:d3d:getColorBits Unsupported format: WINED3DFMT_R32_FLOAT
err:d3d:IWineD3DImpl_IsPixelFormatCompatibleWithRenderFmt Unable to check compatibility for Format=WINED3DFMT_R32_FLOAT
err:d3d:getColorBits Unsupported format: WINED3DFMT_R32_FLOAT
err:d3d:IWineD3DImpl_IsPixelFormatCompatibleWithRenderFmt Unable to check compatibility for Format=WINED3DFMT_R32_FLOAT
err:d3d:getColorBits Unsupported format: WINED3DFMT_R32_FLOAT
err:d3d:IWineD3DImpl_IsPixelFormatCompatibleWithRenderFmt Unable to check compatibility for Format=WINED3DFMT_R32_FLOAT
err:d3d:getColorBits Unsupported format: WINED3DFMT_R32_FLOAT
err:d3d:IWineD3DImpl_IsPixelFormatCompatibleWithRenderFmt Unable to check compatibility for Format=WINED3DFMT_R32_FLOAT
err:d3d:getColorBits Unsupported format: WINED3DFMT_R32_FLOAT
err:d3d:IWineD3DImpl_IsPixelFormatCompatibleWithRenderFmt Unable to check compatibility for Format=WINED3DFMT_R32_FLOAT
err:d3d:getColorBits Unsupported format: WINED3DFMT_R32_FLOAT
err:d3d:IWineD3DImpl_IsPixelFormatCompatibleWithRenderFmt Unable to check compatibility for Format=WINED3DFMT_R32_FLOAT
err:d3d:getColorBits Unsupported format: WINED3DFMT_R32_FLOAT
err:d3d:IWineD3DImpl_IsPixelFormatCompatibleWithRenderFmt Unable to check compatibility for Format=WINED3DFMT_R32_FLOAT
err:d3d:getColorBits Unsupported format: WINED3DFMT_R32_FLOAT
err:d3d:IWineD3DImpl_IsPixelFormatCompatibleWithRenderFmt Unable to check compatibility for Format=WINED3DFMT_R32_FLOAT
err:d3d:getColorBits Unsupported format: WINED3DFMT_R32_FLOAT
err:d3d:IWineD3DImpl_IsPixelFormatCompatibleWithRenderFmt Unable to check compatibility for Format=WINED3DFMT_R32_FLOAT
err:d3d:getColorBits Unsupported format: WINED3DFMT_R32_FLOAT
err:d3d:IWineD3DImpl_IsPixelFormatCompatibleWithRenderFmt Unable to check compatibility for Format=WINED3DFMT_R32_FLOAT
err:d3d:getColorBits Unsupported format: WINED3DFMT_R32_FLOAT
err:d3d:IWineD3DImpl_IsPixelFormatCompatibleWithRenderFmt Unable to check compatibility for Format=WINED3DFMT_R32_FLOAT
err:d3d:getColorBits Unsupported format: WINED3DFMT_R32_FLOAT
err:d3d:IWineD3DImpl_IsPixelFormatCompatibleWithRenderFmt Unable to check compatibility for Format=WINED3DFMT_R32_FLOAT
err:d3d:getColorBits Unsupported format: WINED3DFMT_R32_FLOAT
err:d3d:IWineD3DImpl_IsPixelFormatCompatibleWithRenderFmt Unable to check compatibility for Format=WINED3DFMT_R32_FLOAT
err:d3d:getColorBits Unsupported format: WINED3DFMT_R32_FLOAT
err:d3d:IWineD3DImpl_IsPixelFormatCompatibleWithRenderFmt Unable to check compatibility for Format=WINED3DFMT_R32_FLOAT
err:d3d:getColorBits Unsupported format: WINED3DFMT_R32_FLOAT
err:d3d:IWineD3DImpl_IsPixelFormatCompatibleWithRenderFmt Unable to check compatibility for Format=WINED3DFMT_R32_FLOAT
err:d3d:getColorBits Unsupported format: WINED3DFMT_R32_FLOAT
err:d3d:IWineD3DImpl_IsPixelFormatCompatibleWithRenderFmt Unable to check compatibility for Format=WINED3DFMT_R32_FLOAT
err:d3d:getColorBits Unsupported format: WINED3DFMT_R32_FLOAT
err:d3d:IWineD3DImpl_IsPixelFormatCompatibleWithRenderFmt Unable to check compatibility for Format=WINED3DFMT_R32_FLOAT
err:d3d:getColorBits Unsupported format: WINED3DFMT_R32_FLOAT
err:d3d:IWineD3DImpl_IsPixelFormatCompatibleWithRenderFmt Unable to check compatibility for Format=WINED3DFMT_R32_FLOAT
err:d3d:getColorBits Unsupported format: WINED3DFMT_R32_FLOAT
err:d3d:IWineD3DImpl_IsPixelFormatCompatibleWithRenderFmt Unable to check compatibility for Format=WINED3DFMT_R32_FLOAT
err:d3d:getColorBits Unsupported format: WINED3DFMT_R32_FLOAT
err:d3d:IWineD3DImpl_IsPixelFormatCompatibleWithRenderFmt Unable to check compatibility for Format=WINED3DFMT_R32_FLOAT
err:d3d:getColorBits Unsupported format: WINED3DFMT_R32_FLOAT
err:d3d:IWineD3DImpl_IsPixelFormatCompatibleWithRenderFmt Unable to check compatibility for Format=WINED3DFMT_R32_FLOAT
err:d3d:getColorBits Unsupported format: WINED3DFMT_R32_FLOAT
err:d3d:IWineD3DImpl_IsPixelFormatCompatibleWithRenderFmt Unable to check compatibility for Format=WINED3DFMT_R32_FLOAT
err:d3d:getColorBits Unsupported format: WINED3DFMT_R32_FLOAT
err:d3d:IWineD3DImpl_IsPixelFormatCompatibleWithRenderFmt Unable to check compatibility for Format=WINED3DFMT_R32_FLOAT
err:d3d:getColorBits Unsupported format: WINED3DFMT_R32_FLOAT
err:d3d:IWineD3DImpl_IsPixelFormatCompatibleWithRenderFmt Unable to check compatibility for Format=WINED3DFMT_R32_FLOAT
err:d3d:getColorBits Unsupported format: WINED3DFMT_R32_FLOAT
err:d3d:IWineD3DImpl_IsPixelFormatCompatibleWithRenderFmt Unable to check compatibility for Format=WINED3DFMT_R32_FLOAT
err:d3d:getColorBits Unsupported format: WINED3DFMT_R32_FLOAT
err:d3d:IWineD3DImpl_IsPixelFormatCompatibleWithRenderFmt Unable to check compatibility for Format=WINED3DFMT_R32_FLOAT
err:d3d:getColorBits Unsupported format: WINED3DFMT_R32_FLOAT
err:d3d:IWineD3DImpl_IsPixelFormatCompatibleWithRenderFmt Unable to check compatibility for Format=WINED3DFMT_R32_FLOAT
err:d3d:getColorBits Unsupported format: WINED3DFMT_R32_FLOAT
err:d3d:IWineD3DImpl_IsPixelFormatCompatibleWithRenderFmt Unable to check compatibility for Format=WINED3DFMT_R32_FLOAT
err:d3d:getColorBits Unsupported format: WINED3DFMT_R32_FLOAT
err:d3d:IWineD3DImpl_IsPixelFormatCompatibleWithRenderFmt Unable to check compatibility for Format=WINED3DFMT_R32_FLOAT
err:d3d:getColorBits Unsupported format: WINED3DFMT_R32_FLOAT
err:d3d:IWineD3DImpl_IsPixelFormatCompatibleWithRenderFmt Unable to check compatibility for Format=WINED3DFMT_R32_FLOAT
err:d3d:getColorBits Unsupported format: WINED3DFMT_R32_FLOAT
err:d3d:IWineD3DImpl_IsPixelFormatCompatibleWithRenderFmt Unable to check compatibility for Format=WINED3DFMT_R32_FLOAT
err:d3d:getColorBits Unsupported format: WINED3DFMT_R32_FLOAT
err:d3d:IWineD3DImpl_IsPixelFormatCompatibleWithRenderFmt Unable to check compatibility for Format=WINED3DFMT_R32_FLOAT
err:d3d:getColorBits Unsupported format: WINED3DFMT_R32_FLOAT
err:d3d:IWineD3DImpl_IsPixelFormatCompatibleWithRenderFmt Unable to check compatibility for Format=WINED3DFMT_R32_FLOAT
err:d3d:getColorBits Unsupported format: WINED3DFMT_R32_FLOAT
err:d3d:IWineD3DImpl_IsPixelFormatCompatibleWithRenderFmt Unable to check compatibility for Format=WINED3DFMT_R32_FLOAT
err:d3d:getColorBits Unsupported format: WINED3DFMT_R32_FLOAT
err:d3d:IWineD3DImpl_IsPixelFormatCompatibleWithRenderFmt Unable to check compatibility for Format=WINED3DFMT_R32_FLOAT
err:d3d:getColorBits Unsupported format: WINED3DFMT_R32_FLOAT
err:d3d:IWineD3DImpl_IsPixelFormatCompatibleWithRenderFmt Unable to check compatibility for Format=WINED3DFMT_R32_FLOAT
err:d3d:getColorBits Unsupported format: WINED3DFMT_R32_FLOAT
err:d3d:IWineD3DImpl_IsPixelFormatCompatibleWithRenderFmt Unable to check compatibility for Format=WINED3DFMT_R32_FLOAT
err:d3d:getColorBits Unsupported format: WINED3DFMT_R32_FLOAT
err:d3d:IWineD3DImpl_IsPixelFormatCompatibleWithRenderFmt Unable to check compatibility for Format=WINED3DFMT_R32_FLOAT
err:d3d:getColorBits Unsupported format: WINED3DFMT_R32_FLOAT
err:d3d:IWineD3DImpl_IsPixelFormatCompatibleWithRenderFmt Unable to check compatibility for Format=WINED3DFMT_R32_FLOAT
err:d3d:getColorBits Unsupported format: WINED3DFMT_R32_FLOAT
err:d3d:IWineD3DImpl_IsPixelFormatCompatibleWithRenderFmt Unable to check compatibility for Format=WINED3DFMT_R32_FLOAT
err:d3d:getColorBits Unsupported format: WINED3DFMT_R32_FLOAT
err:d3d:IWineD3DImpl_IsPixelFormatCompatibleWithRenderFmt Unable to check compatibility for Format=WINED3DFMT_R32_FLOAT
err:d3d:getColorBits Unsupported format: WINED3DFMT_R32_FLOAT
err:d3d:IWineD3DImpl_IsPixelFormatCompatibleWithRenderFmt Unable to check compatibility for Format=WINED3DFMT_R32_FLOAT
err:d3d:getColorBits Unsupported format: WINED3DFMT_R32_FLOAT
err:d3d:IWineD3DImpl_IsPixelFormatCompatibleWithRenderFmt Unable to check compatibility for Format=WINED3DFMT_R32_FLOAT
err:d3d:getColorBits Unsupported format: WINED3DFMT_R32_FLOAT
err:d3d:IWineD3DImpl_IsPixelFormatCompatibleWithRenderFmt Unable to check compatibility for Format=WINED3DFMT_R32_FLOAT
err:d3d:getColorBits Unsupported format: WINED3DFMT_R32_FLOAT
err:d3d:IWineD3DImpl_IsPixelFormatCompatibleWithRenderFmt Unable to check compatibility for Format=WINED3DFMT_R32_FLOAT
err:d3d:getColorBits Unsupported format: WINED3DFMT_R32_FLOAT
err:d3d:IWineD3DImpl_IsPixelFormatCompatibleWithRenderFmt Unable to check compatibility for Format=WINED3DFMT_R32_FLOAT
err:d3d:getColorBits Unsupported format: WINED3DFMT_R32_FLOAT
err:d3d:IWineD3DImpl_IsPixelFormatCompatibleWithRenderFmt Unable to check compatibility for Format=WINED3DFMT_R32_FLOAT
err:d3d:getColorBits Unsupported format: WINED3DFMT_R32_FLOAT
err:d3d:IWineD3DImpl_IsPixelFormatCompatibleWithRenderFmt Unable to check compatibility for Format=WINED3DFMT_R32_FLOAT
fixme:d3d:debug_d3dformat Unrecognized 1414745673 (as fourcc: INST) WINED3DFORMAT!
fixme:d3d:getFormatDescEntry Can't find format unrecognized(1414745673) in the format lookup table
fixme:d3d_surface:surface_allocate_surface >>>>>>>>>>>>>>>>> GL_INVALID_ENUM (0x500) from glTexImage2D @ surface.c / 625
fixme:d3d_surface:surface_upload_data >>>>>>>>>>>>>>>>> GL_INVALID_ENUM (0x500) from glTexSubImage2D @ surface.c / 558
fixme:d3d:context_check_fbo_status FBO status GL_FRAMEBUFFER_INCOMPLETE_ATTACHMENT_EXT (0x8cd6)
fixme:d3d:context_check_fbo_status 	Color attachment 0: (0x19ec48) WINED3DFMT_R32_FLOAT 1280x1024
fixme:d3d:IWineD3DDeviceImpl_ClearSurface >>>>>>>>>>>>>>>>> GL_INVALID_FRAMEBUFFER_OPERATION_EXT (0x506) from glClear @ device.c / 5017
fixme:dsalsa:IDsDriverBufferImpl_SetVolumePan (0xd167628,0xd167528): stub
fixme:thread:SetThreadIdealProcessor (0x854): stub
fixme:dsalsa:IDsDriverBufferImpl_SetVolumePan (0xd1a8360,0xd1676f8): stub
fixme:dsalsa:IDsDriverBufferImpl_SetVolumePan (0xe34df60,0xd1676f8): stub
fixme:dsalsa:IDsDriverBufferImpl_SetVolumePan (0xe34df60,0xd1676f8): stub
fixme:win:EnumDisplayDevicesW ((null),0,0x55dcbd0,0x00000000), stub!
fixme:win:EnumDisplayDevicesW ((null),0,0x55dc750,0x00000000), stub!
flo@zigzag:~/.PlayOnLinux/wineprefix/NeedForSpeedUndercover/drive_c/Program Files/EA Games/Need for Speed Undercover$

si quelqu'un peut m'aidé ce serait tres gentil car là ca me depasse

#10 Re : -1 »  nfs undercover » Le 20/07/2009, à 22:54

richon
Réponses : 1

je me suis fait cette reflexion: playonlinux instale un autre wine que celui instalé sur mon ordi donc peut etre que qd je lance

lo@zigzag:~/.PlayOnLinux/wineprefix/NeedForSpeedUndercover/drive_c/Program Files/EA Games/Need for Speed Undercover$ wine nfs.exe

il me le lance avec celui instalé sur mon ordi

j'ai donc essayé ça

flo@zigzag:~$ cd /home/flo/.PlayOnLinux/WineVersions/1.1.14/usr/bin/
flo@zigzag:~/.PlayOnLinux/WineVersions/1.1.14/usr/bin$ wine /home/flo/.PlayOnLinux/wineprefix/NeedForSpeedUndercover/drive_c/Program\ Files/EA\ Games/Need\ for\ Speed\ Undercover/nfs.exe

et là j'ai ce message du terminal (le jeu ne se lance pas une fenetre souvre et me dit que le programme nfs.exe a rencontré une erreur et doit fermer)

flo@zigzag:~/.PlayOnLinux/WineVersions/1.1.14/usr/bin$ wine /home/flo/.PlayOnLinux/wineprefix/NeedForSpeedUndercover/drive_c/Program\ Files/EA\ Games/Need\ for\ Speed\ Undercover/nfs.exe 
err:alsa:ALSA_CheckSetVolume Could not find 'PCM Playback Volume' element
err:alsa:ALSA_CheckSetVolume Could not find 'PCM Playback Volume' element
fixme:mixer:ALSA_MixerInit No master control found on Brooktree Bt878, disabling mixer
fixme:mixer:ALSA_MixerInit No master control found on SAA7134, disabling mixer
fixme:ntdll:NtQueryInformationProcess (0xffffffff,info_class=34,0x236aa0c,0x00000004,0x236aa08) Unknown information class
fixme:ntdll:NtQuerySystemInformation info_class SYSTEM_HANDLE_INFORMATION
fixme:ntdll:NtQueryObject Unsupported information class 3
fixme:debugstr:CheckRemoteDebuggerPresent (0xffffffff)->(0x23697f8): Stub!
err:rpc:I_RpcGetBuffer no binding
fixme:ntdll:NtQueryInformationProcess (process=0xffffffff) Unimplemented information class: ProcessDebugFlags
fixme:win:EnumDisplayDevicesW ((null),0,0x2369654,0x00000000), stub!
fixme:win:EnumDisplayDevicesW ((null),0,0x23691d4,0x00000000), stub!
fixme:psapi:EnumPageFilesA (0x17e1f40, 0x2348adc) stub
fixme:psapi:EnumPageFilesA (0x17e1f40, 0x23133f8) stub
fixme:win:EnumDisplayDevicesW ((null),0,0x22af5cc,0x00000000), stub!
fixme:win:EnumDisplayDevicesW ((null),0,0x22af14c,0x00000000), stub!
fixme:win:EnumDisplayDevicesW ((null),0,0x22aee90,0x00000000), stub!
fixme:win:EnumDisplayDevicesW ((null),0,0x22aea10,0x00000000), stub!
fixme:win:EnumDisplayDevicesW ((null),0,0x22af5d0,0x00000000), stub!
fixme:win:EnumDisplayDevicesW ((null),0,0x22af150,0x00000000), stub!
fixme:ntdll:NtQueryInformationProcess (process=0xffffffff) Unimplemented information class: ProcessDeviceMap
fixme:ntdll:NtQuerySystemInformation info_class SYSTEM_HANDLE_INFORMATION
fixme:ntdll:NtQueryObject Unsupported information class 3
fixme:debugstr:CheckRemoteDebuggerPresent (0xffffffff)->(0x237f894): Stub!
err:rpc:I_RpcGetBuffer no binding
fixme:ntdll:NtQueryInformationProcess (process=0xffffffff) Unimplemented information class: ProcessDebugFlags
fixme:thread:SetThreadIdealProcessor (0x724): stub
fixme:thread:SetThreadIdealProcessor (0x724): stub
fixme:thread:SetThreadIdealProcessor (0x7f0): stub
fixme:thread:SetThreadIdealProcessor (0x7f4): stub
wine: Unhandled page fault on read access to 0xaaaaaaf2 at address 0x8be050 (thread 0035), starting debugger...
Unhandled exception: page fault on read access to 0xaaaaaaf2 in 32-bit code (0x008be050).
Register dump:
 CS:0073 SS:007b DS:007b ES:007b FS:0033 GS:003b
 EIP:008be050 ESP:0a8dea88 EBP:0a8deab8 EFLAGS:00010286(  R- --  I S - -P- )
 EAX:00000035 EBX:63bd0490 ECX:000033e8 EDX:00000000
 ESI:aaaaaaaa EDI:000033e8
Stack dump:
0x0a8dea88:  0a8deab8 7ff641d4 00000000 7bc94ff4
0x0a8dea98:  008c0624 63bd0490 7b88ff90 008bc375
0x0a8deaa8:  7ff64f10 7bc6b928 00000000 7ff64f10
0x0a8deab8:  0a8deb88 7bc6bb30 008bc350 00000000
0x0a8deac8:  00000000 00000000 00000000 ffffffff
0x0a8dead8:  7bc6e000 7b844ea0 7bc94ff4 7ff64f10
Backtrace:
=>0 0x008be050 in nfs (+0x4be050) (0x0a8deab8)
  1 0x7bc6bb30 call_thread_entry_point+0x70() in ntdll (0x0a8deb88)
  2 0x7bc73cab in ntdll (+0x63cab) (0x0a8df3c8)
  3 0xb7f6950f (0x0a8df4c8)
  4 0xb7ee5a0e (0x00000000)
0x008be050: movl	0x48(%esi),%edx
Modules:
Module	Address			Debug info	Name (136 modules)
PE	  230000-  246000	Deferred        xinput1_3
PE	  400000- 1e71000	Export          nfs
PE	 2380000- 26ef000	Deferred        d3dx9_34
PE	10000000-100db000	Deferred        paul
ELF	48bc0000-48bc2000	Deferred        libnvidia-tls.so.1
ELF	49099000-490b6000	Deferred        ld-linux.so.2
ELF	490b8000-49eef000	Deferred        libglcore.so.1
ELF	490b8000-49eef000	Deferred        libglcore.so.1
ELF	49ef5000-4a053000	Deferred        libc.so.6
ELF	4a055000-4a059000	Deferred        libdl.so.2
ELF	4a05b000-4a081000	Deferred        libm.so.6
ELF	4a083000-4a09c000	Deferred        libpthread.so.0
ELF	4a09e000-4a0b4000	Deferred        libz.so.1
ELF	4a0b6000-4a0cf000	Deferred        libxcb.so.1
ELF	4a0d1000-4a0d4000	Deferred        libxau.so.6
ELF	4a0d6000-4a1c5000	Deferred        libx11.so.6
ELF	4a1c7000-4a1cc000	Deferred        libxdmcp.so.6
ELF	4a1ce000-4a1d1000	Deferred        libxcb-xlib.so.0
ELF	4a2b8000-4a2c7000	Deferred        libxext.so.6
ELF	4a2c9000-4a2d2000	Deferred        librt.so.1
ELF	4a31c000-4a343000	Deferred        libexpat.so.1
ELF	4a361000-4a38e000	Deferred        libfontconfig.so.1
ELF	4a390000-4a406000	Deferred        libfreetype.so.6
ELF	4a437000-4a441000	Deferred        libxrender.so.1
ELF	4a443000-4a448000	Deferred        libxfixes.so.3
ELF	4a44a000-4a453000	Deferred        libxcursor.so.1
ELF	4a461000-4a468000	Deferred        libxrandr.so.2
ELF	4a4d4000-4a4d7000	Deferred        libxinerama.so.1
ELF	4a903000-4a907000	Deferred        libxcomposite.so.1
ELF	4a94a000-4a959000	Deferred        libgcc_s.so.1
ELF	4aaa3000-4aaac000	Deferred        libsm.so.6
ELF	4aaae000-4aac6000	Deferred        libice.so.6
ELF	4abf5000-4ac0e000	Deferred        libnsl.so.1
ELF	4ac10000-4ac14000	Deferred        libcap.so.1
ELF	4adc7000-4addb000	Deferred        libresolv.so.2
ELF	4ae32000-4ae9b000	Deferred        libgcrypt.so.11
ELF	4ae9d000-4aea1000	Deferred        libgpg-error.so.0
ELF	4aea3000-4af40000	Deferred        libgnutls.so.26
ELF	4af76000-4af88000	Deferred        libtasn1.so.3
ELF	4afd7000-4b09f000	Deferred        libasound.so.2
ELF	4b305000-4b309000	Deferred        libcom_err.so.2
ELF	4b30b000-4b30f000	Deferred        libkeyutils.so.1
ELF	4b311000-4b31a000	Deferred        libkrb5support.so.0
ELF	4b33f000-4b345000	Deferred        libxxf86vm.so.1
ELF	4b41d000-4b44f000	Deferred        libcrypt.so.1
ELF	4b483000-4b515000	Deferred        libkrb5.so.3
ELF	4b517000-4b53b000	Deferred        libk5crypto.so.3
ELF	4b544000-4b56f000	Deferred        libgssapi_krb5.so.2
ELF	4cc92000-4cce2000	Deferred        libpulse.so.0
ELF	4de5d000-4df99000	Deferred        libwine.so.1
PE	78130000-781cb000	Deferred        msvcr80
ELF	7b800000-7b962000	Deferred        kernel32<elf>
  \-PE	7b820000-7b962000	\               kernel32
ELF	7bc00000-7bcb1000	Export          ntdll<elf>
  \-PE	7bc10000-7bcb1000	\               ntdll
ELF	7bf00000-7bf04000	Deferred        <wine-loader>
PE	7c420000-7c4a7000	Deferred        msvcp80
ELF	7c556000-7c5af000	Deferred        riched20<elf>
  \-PE	7c560000-7c5af000	\               riched20
ELF	7d646000-7d65c000	Deferred        psapi<elf>
  \-PE	7d650000-7d65c000	\               psapi
ELF	7d6b9000-7d75e000	Deferred        libgl.so.1
ELF	7d75e000-7d773000	Deferred        midimap<elf>
  \-PE	7d760000-7d773000	\               midimap
ELF	7d773000-7d799000	Deferred        msacm32<elf>
  \-PE	7d780000-7d799000	\               msacm32
ELF	7d799000-7d7b1000	Deferred        msacm32<elf>
  \-PE	7d7a0000-7d7b1000	\               msacm32
ELF	7d8dd000-7d914000	Deferred        winealsa<elf>
  \-PE	7d8f0000-7d914000	\               winealsa
ELF	7dd71000-7dd8c000	Deferred        wsock32<elf>
  \-PE	7dd80000-7dd8c000	\               wsock32
ELF	7ddad000-7ddb4000	Deferred        libasound_module_pcm_pulse.so
ELF	7ddb4000-7ddd4000	Deferred        iphlpapi<elf>
  \-PE	7ddc0000-7ddd4000	\               iphlpapi
ELF	7ddd4000-7ddfb000	Deferred        netapi32<elf>
  \-PE	7dde0000-7ddfb000	\               netapi32
ELF	7ddfb000-7de97000	Deferred        winmm<elf>
  \-PE	7de10000-7de97000	\               winmm
ELF	7de97000-7dee3000	Deferred        dsound<elf>
  \-PE	7dea0000-7dee3000	\               dsound
ELF	7dee3000-7df13000	Deferred        wintrust<elf>
  \-PE	7def0000-7df13000	\               wintrust
ELF	7df13000-7df2b000	Deferred        imagehlp<elf>
  \-PE	7df20000-7df2b000	\               imagehlp
ELF	7df2b000-7dfb4000	Deferred        crypt32<elf>
  \-PE	7df40000-7dfb4000	\               crypt32
ELF	7dfb4000-7e09c000	Deferred        oleaut32<elf>
  \-PE	7dfd0000-7e09c000	\               oleaut32
ELF	7e09c000-7e0ca000	Deferred        ws2_32<elf>
  \-PE	7e0a0000-7e0ca000	\               ws2_32
ELF	7e118000-7e14b000	Deferred        uxtheme<elf>
  \-PE	7e120000-7e14b000	\               uxtheme
ELF	7e174000-7e195000	Deferred        imm32<elf>
  \-PE	7e180000-7e195000	\               imm32
ELF	7e2e1000-7e37e000	Deferred        winex11<elf>
  \-PE	7e2f0000-7e37e000	\               winex11
ELF	7e4db000-7e5a3000	Deferred        comctl32<elf>
  \-PE	7e4e0000-7e5a3000	\               comctl32
ELF	7e5a3000-7e601000	Deferred        shlwapi<elf>
  \-PE	7e5b0000-7e601000	\               shlwapi
ELF	7e601000-7e78e000	Deferred        shell32<elf>
  \-PE	7e610000-7e78e000	\               shell32
ELF	7e78e000-7e7a2000	Deferred        shfolder<elf>
  \-PE	7e790000-7e7a2000	\               shfolder
ELF	7e7a2000-7e7b6000	Deferred        lz32<elf>
  \-PE	7e7b0000-7e7b6000	\               lz32
ELF	7e7b6000-7e7d1000	Deferred        version<elf>
  \-PE	7e7c0000-7e7d1000	\               version
ELF	7e7d1000-7e807000	Deferred        winspool<elf>
  \-PE	7e7e0000-7e807000	\               winspool
ELF	7e807000-7e877000	Deferred        setupapi<elf>
  \-PE	7e810000-7e877000	\               setupapi
ELF	7e877000-7e8e4000	Deferred        rpcrt4<elf>
  \-PE	7e880000-7e8e4000	\               rpcrt4
ELF	7e8e4000-7e9e0000	Deferred        ole32<elf>
  \-PE	7e900000-7e9e0000	\               ole32
ELF	7e9e0000-7ea19000	Deferred        dinput<elf>
  \-PE	7e9f0000-7ea19000	\               dinput
ELF	7ea19000-7ea33000	Deferred        dinput8<elf>
  \-PE	7ea20000-7ea33000	\               dinput8
ELF	7ea33000-7eaa2000	Deferred        msvcrt<elf>
  \-PE	7ea40000-7eaa2000	\               msvcrt
ELF	7eac4000-7eb1a000	Deferred        advapi32<elf>
  \-PE	7ead0000-7eb1a000	\               advapi32
ELF	7eb1a000-7ebbc000	Deferred        gdi32<elf>
  \-PE	7eb30000-7ebbc000	\               gdi32
ELF	7ebbc000-7ed08000	Deferred        user32<elf>
  \-PE	7ebe0000-7ed08000	\               user32
ELF	7ed08000-7ee45000	Deferred        wined3d<elf>
  \-PE	7ed20000-7ee45000	\               wined3d
ELF	7ee45000-7ee76000	Deferred        d3d9<elf>
  \-PE	7ee50000-7ee76000	\               d3d9
ELF	7ef96000-7efa2000	Deferred        libnss_files.so.2
ELF	7efa2000-7efad000	Deferred        libnss_nis.so.2
ELF	b7df6000-b7dff000	Deferred        libnss_compat.so.2
Threads:
process  tid      prio (all id:s are in hex)
00000008 (D) Z:\home\flo\.PlayOnLinux\wineprefix\NeedForSpeedUndercover\drive_c\Program Files\EA Games\Need for Speed Undercover\nfs.exe
	00000036    2
	00000035    2 <==
	00000034    2
	00000033    0
	00000032    1
	00000031    2
	00000030    0
	0000002f    0
	00000026    0
	00000009    0
0000000e 
	00000019    0
	00000015    0
	00000014    0
	00000010    0
	0000000f    0
00000011 
	00000017    0
	00000016    0
	00000013    0
	00000012    0
00000023 
	00000024    0
Backtrace:
=>0 0x008be050 in nfs (+0x4be050) (0x0a8deab8)
  1 0x7bc6bb30 call_thread_entry_point+0x70() in ntdll (0x0a8deb88)
  2 0x7bc73cab in ntdll (+0x63cab) (0x0a8df3c8)
  3 0xb7f6950f (0x0a8df4c8)
  4 0xb7ee5a0e (0x00000000)
fixme:win:EnumDisplayDevicesW ((null),0,0xb23cbd0,0x00000000), stub!
fixme:win:EnumDisplayDevicesW ((null),0,0xb23c750,0x00000000), stub!
flo@zigzag:~/.PlayOnLinux/WineVersions/1.1.14/usr/bin$

donc l'erreur serait plutot:
err:rpc:I_RpcGetBuffer no binding

ou pensez vous que ça vient de
err:alsa:ALSA_CheckSetVolume Could not find 'PCM Playback Volume' element
err:alsa:ALSA_CheckSetVolume Could not find 'PCM Playback Volume' element
fixme:mixer:ALSA_MixerInit No master control found on Brooktree Bt878, disabling mixer
fixme:mixer:ALSA_MixerInit No master control found on SAA7134, disabling mixer

#11 -1 »  telecommande » Le 08/07/2009, à 12:50

richon
Réponses : 0

bonjour,

je suis sous intrepid et j'utilise une carte hauppauge win tv hvr 1100 ou 1110

il y'a avec une telecommande ir

je ne veux pas utiliser lirc donc j'ai chargé le module en tapant dans un terminale

$ sudo modprobe ir-kbd-i2c

de là ma telecommande est reconnue comme un clavier et a une touche de la telecommande est associé une touche du clavier

le probleme c'est que la touche 1 de ma telecommande correspond a la touche & de mon clavier.

pour cela je pourrais utiliser xmodmap avec xbindkeys et xvkbd. mais il faut apres activer ou desactiver pour redonner les touches normale au clavier.

ma question est la suivante, mes touches de la télécommande son reconnues comme des touches clavier donc il y'a bien un endroi ou il y'a un fichier qui lui dit tel touche correspond a tel touche etc... et donc de changer ce fichier (ou je ne c'est quoi) pour que la touche 1 de ma telecommande correspond a la touche 1 du pavé numerique du clavier .
mais sans faire de redirection de touche avec modmap etc... qui donnerait en faite ma touche & deviens ma touche 1 du pavé ce qui est embetant pour d'autre tache.

si qq'un a une idée ?

#12 -1 »  wine probleme son » Le 19/05/2009, à 20:44

richon
Réponses : 2

bonjour je viens d'installer gta vice city avec wine. c'est la premiere fois que j'installe un jeu avec wine et j'ai un probleme de son car je n'en est pas. qd je lance winecfg j'ai ce message:

flo@zigzag:~$ winecfg
err:alsa:ALSA_CheckSetVolume Could not find 'PCM Playback Volume' element
err:alsa:ALSA_CheckSetVolume Could not find 'PCM Playback Volume' element
fixme:mixer:ALSA_MixerInit No master control found on Brooktree Bt878, disabling mixer
fixme:mixer:ALSA_MixerInit No master control found on SAA7134, disabling mixer

voila si qq'un peux m'aider ce serait gentil
dans l'onglet son de winecfg je suis sur alsa

et aussi le jeu a l'air de bien marcher mais sans son c'est bizare sauf pour la video de tout debut juste apres commencer une partie là les image son tres tres mais tres lente et pas de son est- ce normal

merci a plus

#13 Re : -1 »  wine probleme son » Le 20/05/2009, à 15:21

richon
Réponses : 2

merci je v essayer

#14 -1 »  probleme SBA et fast write » Le 20/12/2008, à 17:28

richon
Réponses : 2

bonjour, j'ai une GeForce FX 5500 et je n'arrive pas a activer le sba et le fast write alors que ma carte et mon port agp le supporte. et j'ai bien suivi le tuto

si qq'un a une idée ce serait sympas**

merci

#15 Re : -1 »  probleme SBA et fast write » Le 21/12/2008, à 17:19

richon
Réponses : 2

ok merci mais de toute façon mon ordi tourne bien là donc je ne vais pas les activer.

#16 -1 »  question ... » Le 20/12/2008, à 12:09

richon
Réponses : 2

je cherche a changer ma carte graphique GeForce2

mon ordi est un dell optiplex  GX 260

ma question : sur ma port AGP puis je mettre n'importe quelle GeForce du moment quel est AGP
, et même si c'est une AGP 8x?

je vous remercie

#17 Re : -1 »  question ... » Le 20/12/2008, à 12:45

richon
Réponses : 2

ok je te remerci

#18 Re : -1 »  [Clos] Centralisation Probleme Webcam+EasyCam » Le 03/08/2008, à 17:08

richon
Réponses : 2370

bonjour anbreizh

j'ai un souci avec ma cam elle ne marche pas avec amsn

flo@zigzag:~$ lsusb
Bus 004 Device 001: ID 0000:0000  
Bus 003 Device 001: ID 0000:0000  
Bus 002 Device 001: ID 0000:0000  
Bus 001 Device 006: ID 0ac8:0302 Z-Star Microelectronics Corp. ZC0302 WebCam
Bus 001 Device 004: ID 046d:c50b Logitech, Inc. Cordless Desktop Optical
Bus 001 Device 001: ID 0000:0000  
flo@zigzag:~$

ma cam est une Z-Star

flo@zigzag:~$ gstreamer-properties
gstreamer-properties-Message: Skipping unavailable plugin 'artsdsink'
gstreamer-properties-Message: Skipping unavailable plugin 'esdsink'
gstreamer-properties-Message: Skipping unavailable plugin 'sdlvideosink'
gstreamer-properties-Message: Skipping unavailable plugin 'v4lmjpegsrc'
gstreamer-properties-Message: Skipping unavailable plugin 'qcamsrc'
gstreamer-properties-Message: Skipping unavailable plugin 'esdmon'

cette commande m'ouvre le selecteur de media je me place dans video

grefon d'entré pour video j'ai V4l

peripherique j'ai bien ma Z-Star

pipeline : v4lsrc device="/dev/video1/

quand je fais le test ma cam marche bien

maintenant avec easycam2 j'ai un ecran tout noir

je te poste mon dmesg

[   20.440276] usbcore: registered new interface driver hub
[   20.447730] usbcore: registered new device driver usb
[   20.464155] USB Universal Host Controller Interface driver v3.0
[   20.464258] ACPI: PCI Interrupt 0000:00:1d.0[A] -> GSI 16 (level, low) -> IRQ 16
[   20.464273] PCI: Setting latency timer of device 0000:00:1d.0 to 64
[   20.464279] uhci_hcd 0000:00:1d.0: UHCI Host Controller
[   20.464689] uhci_hcd 0000:00:1d.0: new USB bus registered, assigned bus number 1
[   20.464726] uhci_hcd 0000:00:1d.0: irq 16, io base 0x0000ff80
[   20.464928] usb usb1: configuration #1 chosen from 1 choice
[   20.464965] hub 1-0:1.0: USB hub found
[   20.464974] hub 1-0:1.0: 2 ports detected
[   20.544318] SCSI subsystem initialized
[   20.568060] ACPI: PCI Interrupt 0000:00:1d.1[b] -> GSI 19 (level, low) -> IRQ 17
[   20.568077] PCI: Setting latency timer of device 0000:00:1d.1 to 64
[   20.568083] uhci_hcd 0000:00:1d.1: UHCI Host Controller
[   20.568119] uhci_hcd 0000:00:1d.1: new USB bus registered, assigned bus number 2
[   20.568152] uhci_hcd 0000:00:1d.1: irq 17, io base 0x0000ff60
[   20.568312] usb usb2: configuration #1 chosen from 1 choice
[   20.568348] hub 2-0:1.0: USB hub found
[   20.568356] hub 2-0:1.0: 2 ports detected
[   20.633086] libata version 3.00 loaded.
[   20.671888] ACPI: PCI Interrupt 0000:00:1d.2[C] -> GSI 18 (level, low) -> IRQ 18
[   20.671905] PCI: Setting latency timer of device 0000:00:1d.2 to 64
[   20.671911] uhci_hcd 0000:00:1d.2: UHCI Host Controller
[   20.671952] uhci_hcd 0000:00:1d.2: new USB bus registered, assigned bus number 3
[   20.671985] uhci_hcd 0000:00:1d.2: irq 18, io base 0x0000ff40
[   20.672158] usb usb3: configuration #1 chosen from 1 choice
[   20.672195] hub 3-0:1.0: USB hub found
[   20.672204] hub 3-0:1.0: 2 ports detected
[   20.747743] Floppy drive(s): fd0 is 1.44M
[   20.765681] FDC 0 is a post-1991 82077
[   20.775826] ACPI: PCI Interrupt 0000:00:1d.7[D] -> GSI 23 (level, low) -> IRQ 19
[   20.775847] PCI: Setting latency timer of device 0000:00:1d.7 to 64
[   20.775852] ehci_hcd 0000:00:1d.7: EHCI Host Controller
[   20.775893] ehci_hcd 0000:00:1d.7: new USB bus registered, assigned bus number 4
[   20.779810] ehci_hcd 0000:00:1d.7: debug port 1
[   20.779819] PCI: cache line size of 128 is not supported by device 0000:00:1d.7
[   20.779832] ehci_hcd 0000:00:1d.7: irq 19, io mem 0xfe300000
[   20.807508] usb 1-1: new full speed USB device using uhci_hcd and address 2
[   20.819466] ehci_hcd 0000:00:1d.7: USB 2.0 started, EHCI 1.00, driver 10 Dec 2004
[   20.819657] usb usb4: configuration #1 chosen from 1 choice
[   20.819696] hub 4-0:1.0: USB hub found
[   20.819707] hub 4-0:1.0: 6 ports detected
[   20.923665] ACPI: PCI Interrupt 0000:02:09.0[A] -> GSI 18 (level, low) -> IRQ 18
[   20.923710] skge 1.13 addr 0xfe1f8000 irq 18 chip Yukon rev 1
[   20.924120] skge eth0: addr 00:30:bd:b2:6b:89
[   20.931689] PCI: Enabling device 0000:00:1f.1 (0005 -> 0007)
[   20.931701] ACPI: PCI Interrupt 0000:00:1f.1[A] -> GSI 18 (level, low) -> IRQ 18
[   20.931771] PCI: Setting latency timer of device 0000:00:1f.1 to 64
[   20.931789] ACPI: PCI interrupt for device 0000:00:1f.1 disabled
[   20.938712] ata_piix 0000:00:1f.1: version 2.12
[   20.938740] ACPI: PCI Interrupt 0000:00:1f.1[A] -> GSI 18 (level, low) -> IRQ 18
[   20.938811] PCI: Setting latency timer of device 0000:00:1f.1 to 64
[   20.940580] scsi0 : ata_piix
[   20.941790] scsi1 : ata_piix
[   20.941860] ata1: PATA max UDMA/100 cmd 0x1f0 ctl 0x3f6 bmdma 0xffa0 irq 14
[   20.941864] ata2: PATA max UDMA/100 cmd 0x170 ctl 0x376 bmdma 0xffa8 irq 15
[   21.103529] ata1.00: ATA-7: Maxtor 6E040L0, NAR61590, max UDMA/133
[   21.103535] ata1.00: 80293248 sectors, multi 8: LBA 
[   21.119356] ata1.00: configured for UDMA/100
[   21.430830] ata2.00: ATAPI: LITEON  DVD-ROM LTD163, GDHG, max UDMA/33
[   21.594321] ata2.00: configured for UDMA/33
[   21.594499] scsi 0:0:0:0: Direct-Access     ATA      Maxtor 6E040L0   NAR6 PQ: 0 ANSI: 5
[   21.594881] scsi 1:0:0:0: CD-ROM            LITEON   DVD-ROM LTD163   GDHG PQ: 0 ANSI: 5
[   21.609164] Driver 'sd' needs updating - please use bus_type methods
[   21.609294] sd 0:0:0:0: [sda] 80293248 512-byte hardware sectors (41110 MB)
[   21.609314] sd 0:0:0:0: [sda] Write Protect is off
[   21.609318] sd 0:0:0:0: [sda] Mode Sense: 00 3a 00 00
[   21.609347] sd 0:0:0:0: [sda] Write cache: enabled, read cache: enabled, doesn't support DPO or FUA
[   21.609418] sd 0:0:0:0: [sda] 80293248 512-byte hardware sectors (41110 MB)
[   21.609435] sd 0:0:0:0: [sda] Write Protect is off
[   21.609438] sd 0:0:0:0: [sda] Mode Sense: 00 3a 00 00
[   21.609466] sd 0:0:0:0: [sda] Write cache: enabled, read cache: enabled, doesn't support DPO or FUA
[   21.609472]  sda:<4>Driver 'sr' needs updating - please use bus_type methods
[   21.617868]  sda1 sda2 sda3
[   21.632074] sd 0:0:0:0: [sda] Attached SCSI disk
[   21.640896] sr0: scsi3-mmc drive: 0x/48x cd/rw xa/form2 cdda tray
[   21.640903] Uniform CD-ROM driver Revision: 3.20
[   21.640980] sr 1:0:0:0: Attached scsi CD-ROM sr0
[   21.641408] sd 0:0:0:0: Attached scsi generic sg0 type 0
[   21.641439] sr 1:0:0:0: Attached scsi generic sg1 type 5
[   21.665976] usb 1-1: new full speed USB device using uhci_hcd and address 3
[   21.876213] usb 1-1: configuration #1 chosen from 1 choice
[   22.047785] Attempting manual resume
[   22.047791] swsusp: Resume From Partition 8:2
[   22.047794] PM: Checking swsusp image.
[   22.048091] PM: Resume from disk failed.
[   22.069701] EXT3-fs: INFO: recovery required on readonly filesystem.
[   22.069707] EXT3-fs: write access will be enabled during recovery.
[   22.117143] usb 1-2: new low speed USB device using uhci_hcd and address 4
[   22.294434] usb 1-2: configuration #1 chosen from 1 choice
[   22.342664] usbcore: registered new interface driver hiddev
[   22.356609] input: Logitech USB Receiver as /devices/pci0000:00/0000:00:1d.0/usb1/1-2/1-2:1.0/input/input1
[   22.364838] input,hidraw0: USB HID v1.10 Keyboard [Logitech USB Receiver] on usb-0000:00:1d.0-2
[   22.394725] input: Logitech USB Receiver as /devices/pci0000:00/0000:00:1d.0/usb1/1-2/1-2:1.1/input/input2
[   22.416655] input,hidraw1: USB HID v1.10 Mouse [Logitech USB Receiver] on usb-0000:00:1d.0-2
[   22.416681] usbcore: registered new interface driver usbhid
[   22.416687] /build/buildd/linux-2.6.24/drivers/hid/usbhid/hid-core.c: v2.6:USB HID core driver
[   23.624070] kjournald starting.  Commit interval 5 seconds
[   23.624096] EXT3-fs: sda1: orphan cleanup on readonly fs
[   23.624106] ext3_orphan_cleanup: deleting unreferenced inode 261196
[   23.624187] ext3_orphan_cleanup: deleting unreferenced inode 261197
[   23.624201] ext3_orphan_cleanup: deleting unreferenced inode 261195
[   23.624234] ext3_orphan_cleanup: deleting unreferenced inode 261194
[   23.624274] ext3_orphan_cleanup: deleting unreferenced inode 261193
[   23.624315] ext3_orphan_cleanup: deleting unreferenced inode 261191
[   23.624359] ext3_orphan_cleanup: deleting unreferenced inode 490748
[   23.624390] ext3_orphan_cleanup: deleting unreferenced inode 261146
[   23.624398] EXT3-fs: sda1: 8 orphan inodes deleted
[   23.624401] EXT3-fs: recovery complete.
[   23.691113] EXT3-fs: mounted filesystem with ordered data mode.
[   33.028922] pci_hotplug: PCI Hot Plug PCI Core version: 0.5
[   33.078327] shpchp: Standard Hot Plug PCI Controller Driver version: 0.4
[   33.178884] iTCO_vendor_support: vendor-support=0
[   33.224001] iTCO_wdt: Intel TCO WatchDog Timer Driver v1.02 (26-Jul-2007)
[   33.225396] iTCO_wdt: failed to reset NO_REBOOT flag, reboot disabled by hardware
[   33.225409] iTCO_wdt: No card detected
[   33.280019] Linux agpgart interface v0.102
[   33.365285] agpgart: Detected an Intel 830M Chipset.
[   33.369210] agpgart: AGP aperture is 64M @ 0xf0000000
[   33.417651] input: PC Speaker as /devices/platform/pcspkr/input/input3
[   33.536813] intel_rng: FWH not detected
[   33.910344] input: Power Button (FF) as /devices/virtual/input/input4
[   33.920166] ACPI: Power Button (FF) [PWRF]
[   33.920309] input: Power Button (CM) as /devices/virtual/input/input5
[   33.936095] ACPI: Power Button (CM) [VBTN]
[   34.858464] Linux video capture interface: v2.00
[   35.451673] nvidia: module license 'NVIDIA' taints kernel.
[   36.048457] parport_pc 00:07: reported by Plug and Play ACPI
[   36.048515] parport0: PC-style at 0x378 (0x778), irq 7, using FIFO [PCSPP,TRISTATE,COMPAT,ECP]
[   36.089657] bttv: driver version 0.9.17 loaded
[   36.089664] bttv: using 8 buffers with 2080k (520 pages) each for capture
[   36.089751] bttv: Bt8xx card found (0).
[   36.089781] ACPI: PCI Interrupt 0000:02:07.0[A] -> GSI 16 (level, low) -> IRQ 16
[   36.089796] bttv0: Bt878 (rev 17) at 0000:02:07.0, irq: 16, latency: 64, mmio: 0xf40ff000
[   36.091325] bttv0: detected: Pinnacle PCTV [bswap] [card=39], PCI subsystem ID is bd11:1200
[   36.091332] bttv0: using: Pinnacle PCTV Studio/Rave [card=39,autodetected]
[   36.091369] bttv0: gpio: en=00000000, out=00000000 in=00ff27ff [init]
[   36.095598] bttv0: i2c: checking for MSP34xx @ 0x80... not found
[   36.103615] bttv0: miro: id=9 tuner=3 radio=no stereo=no
[   36.103621] bttv0: tuner type=3
[   36.103626] bttv0: i2c: checking for MSP34xx @ 0x80... not found
[   36.104240] bttv0: i2c: checking for TDA9875 @ 0xb0... not found
[   36.105065] bttv0: i2c: checking for TDA7432 @ 0x8a... not found
[   36.152065] saa7130/34: v4l2 driver version 0.2.14 loaded
[   36.369100] All bytes are equal. It is not a TEA5767
[   36.369108] tuner 0-0060: chip found @ 0xc0 (bt878 #0 [sw])
[   36.369144] tuner-simple 0-0060: type set to 3 (Philips (SECAM+PAL_BG) (FI1216MF, FM1216MF, FR1216MF))
[   36.369149] tuner 0-0060: type set to Philips (SECAM+PAL_
[   36.369154] tuner-simple 0-0060: type set to 3 (Philips (SECAM+PAL_BG) (FI1216MF, FM1216MF, FR1216MF))
[   36.369158] tuner 0-0060: type set to Philips (SECAM+PAL_
[   36.425341] bttv0: registered device video0
[   36.425373] bttv0: registered device vbi0
[   36.425398] bttv0: PLL: 28636363 => 35468950 .. ok
[   36.456971] ACPI: PCI Interrupt 0000:02:08.0[A] -> GSI 17 (level, low) -> IRQ 20
[   36.456984] saa7133[0]: found at 0000:02:08.0, rev: 209, irq: 20, latency: 64, mmio: 0xfe1ff800
[   36.456993] saa7133[0]: subsystem: 0070:6701, board: Hauppauge WinTV-HVR1110 DVB-T/Hybrid [card=104,autodetected]
[   36.457010] saa7133[0]: board init: gpio is 6400000
[   36.559863] dcdbas dcdbas: Dell Systems Management Base Driver (version 5.6.0-3.2)
[   36.583506] input: HVR 1110 as /devices/virtual/input/input6
[   36.586390] bt878: AUDIO driver version 0.0.0 loaded
[   36.595413] ir-kbd-i2c: HVR 1110 detected at i2c-1/1-0071/ir0 [saa7133[0]]
[   36.667234] tuner 1-004b: chip found @ 0x96 (saa7133[0])
[   36.715123] tda8290 1-004b: setting tuner address to 61
[   36.822935] tuner 1-004b: type set to tda8290+75a
[   36.870842] tda8290 1-004b: setting tuner address to 61
[   36.974666] tuner 1-004b: type set to tda8290+75a
[   37.006600] saa7133[0]: i2c eeprom 00: 70 00 01 67 54 20 1c 00 43 43 a9 1c 55 d2 b2 92
[   37.006616] saa7133[0]: i2c eeprom 10: ff ff ff 0e ff 20 ff ff ff ff ff ff ff ff ff ff
[   37.006630] saa7133[0]: i2c eeprom 20: 01 40 01 32 32 01 01 33 88 ff 00 aa ff ff ff ff
[   37.006644] saa7133[0]: i2c eeprom 30: ff ff ff ff ff ff ff ff ff ff ff ff ff ff ff ff
[   37.006657] saa7133[0]: i2c eeprom 40: ff 21 00 c2 96 10 03 32 15 60 ff ff ff ff ff ff
[   37.006670] saa7133[0]: i2c eeprom 50: ff 00 00 00 00 00 00 00 00 00 00 00 00 00 00 00
[   37.006683] saa7133[0]: i2c eeprom 60: 00 00 00 00 00 00 00 00 00 00 00 00 00 00 00 00
[   37.006696] saa7133[0]: i2c eeprom 70: 00 00 00 00 00 00 00 00 00 00 00 00 00 00 00 00
[   37.177835] /build/buildd/linux-ubuntu-modules-2.6.24-2.6.24/debian/build/build-generic/media/gspcav1/gspca_core.c: USB GSPCA camera found.(ZC3XX) 
[   37.564173] usbcore: registered new interface driver gspca
[   37.564182] /build/buildd/linux-ubuntu-modules-2.6.24-2.6.24/debian/build/build-generic/media/gspcav1/gspca_core.c: gspca driver 01.00.20 registered
[   37.684216] usbcore: registered new interface driver snd-usb-audio
[   39.222748] saa7133[0]: registered device video2 [v4l2]
[   39.222779] saa7133[0]: registered device vbi1
[   39.222805] saa7133[0]: registered device radio0
[   39.286717] bt878: Bt878 AUDIO function found (0).
[   39.286745] ACPI: PCI Interrupt 0000:02:07.1[A] -> GSI 16 (level, low) -> IRQ 16
[   39.286755] bt878_probe: card id=[0x1200bd11], Unknown card.
[   39.286757] Exiting..
[   39.286762] ACPI: PCI interrupt for device 0000:02:07.1 disabled
[   39.286771] bt878: probe of 0000:02:07.1 failed with error -22
[   39.290685] ACPI: PCI Interrupt 0000:01:00.0[A] -> GSI 16 (level, low) -> IRQ 16
[   39.291191] NVRM: loading NVIDIA Linux x86 Kernel Module  96.43.05  Tue Jan 22 19:36:58 PST 2008
[   39.291874] ACPI: PCI Interrupt 0000:02:0a.0[A] -> GSI 19 (level, low) -> IRQ 17
[   39.387680] ACPI: PCI Interrupt 0000:02:07.1[A] -> GSI 16 (level, low) -> IRQ 16
[   39.388178] ALSA /build/buildd/linux-ubuntu-modules-2.6.24-2.6.24/debian/build/build-generic/sound/alsa-driver/pci/bt87x.c:947: bt87x0: Using board 1, analog, digital (rate 32000 Hz)
[   39.406716] saa7134 ALSA driver for DMA sound loaded
[   39.406760] saa7133[0]/alsa: saa7133[0] at 0xfe1ff800 irq 20 registered as card -2
[   39.616338] DVB: registering new adapter (saa7133[0])
[   39.616346] DVB: registering frontend 0 (Philips TDA10046H DVB-T)...
[   39.685827] tda1004x: setting up plls for 48MHz sampling clock
[   40.563103] loop: module loaded
[   40.604294] lp0: using parport0 (interrupt-driven).
[   40.712120] Adding 979956k swap on /dev/sda2.  Priority:-1 extents:1 across:979956k
[   41.288609] EXT3 FS on sda1, internal journal
[   41.945797] tda1004x: timeout waiting for DSP ready
[   41.985726] tda1004x: found firmware revision 0 -- invalid
[   41.985732] tda1004x: trying to boot from eeprom
[   42.627670] kjournald starting.  Commit interval 5 seconds
[   42.627870] EXT3 FS on sda3, internal journal
[   42.627875] EXT3-fs: mounted filesystem with ordered data mode.
[   43.188964] ip_tables: (C) 2000-2006 Netfilter Core Team
[   43.738290] No dock devices found.
[   44.305661] tda1004x: timeout waiting for DSP ready
[   44.345535] tda1004x: found firmware revision 0 -- invalid
[   44.345543] tda1004x: waiting for firmware upload...
[   45.574713] apm: BIOS version 1.2 Flags 0x03 (Driver version 1.16ac)
[   45.574721] apm: overridden by ACPI.
[   45.756357] ppdev: user-space parallel port driver
[   45.957395] audit(1217634191.485:2): type=1503 operation="inode_permission" requested_mask="a::" denied_mask="a::" name="/dev/tty" pid=4881 profile="/usr/sbin/cupsd" namespace="default"
[   56.979011] tda1004x: found firmware revision 20 -- ok
[   63.557147] /build/buildd/linux-ubuntu-modules-2.6.24-2.6.24/debian/build/build-generic/media/gspcav1/gspca_core.c: init isoc: usb_submit_urb(0) ret -28
[   72.510298] skge eth0: enabling interface
[   72.642243] Bluetooth: Core ver 2.11
[   72.643960] NET: Registered protocol family 31
[   72.643967] Bluetooth: HCI device and connection manager initialized
[   72.643973] Bluetooth: HCI socket layer initialized
[   72.667160] Bluetooth: L2CAP ver 2.9
[   72.667167] Bluetooth: L2CAP socket layer initialized
[   72.748093] Bluetooth: RFCOMM socket layer initialized
[   72.748118] Bluetooth: RFCOMM TTY layer initialized
[   72.748121] Bluetooth: RFCOMM ver 1.8
[   74.775874] agpgart: Found an AGP 2.0 compliant device at 0000:00:00.0.
[   74.776258] agpgart: Putting AGP V2 device at 0000:00:00.0 into 4x mode
[   74.776517] agpgart: Putting AGP V2 device at 0000:01:00.0 into 4x mode
[   75.513340] skge eth0: Link is up at 100 Mbps, full duplex, flow control both
[   77.673659] NET: Registered protocol family 17
[   90.177153] NET: Registered protocol family 10
[   90.177865] lo: Disabled Privacy Extensions
[  100.837584] eth0: no IPv6 routers present
[ 2665.581795] tda1004x: setting up plls for 48MHz sampling clock
[ 2665.865292] tda1004x: found firmware revision 20 -- ok
[ 2671.507238] tda1004x: setting up plls for 48MHz sampling clock
[ 2671.790735] tda1004x: found firmware revision 20 -- ok
[ 2871.526844] tda1004x: setting up plls for 48MHz sampling clock
[ 2871.810359] tda1004x: found firmware revision 20 -- ok
[57805.123420] tda1004x: setting up plls for 48MHz sampling clock
[57805.406938] tda1004x: found firmware revision 20 -- ok
[57819.945012] tda1004x: setting up plls for 48MHz sampling clock
[57820.228504] tda1004x: found firmware revision 20 -- ok
[71274.956690] /build/buildd/linux-ubuntu-modules-2.6.24-2.6.24/debian/build/build-generic/media/gspcav1/gspca_core.c: init isoc: usb_submit_urb(0) ret -28
[71295.212845] /build/buildd/linux-ubuntu-modules-2.6.24-2.6.24/debian/build/build-generic/media/gspcav1/gspca_core.c: init isoc: usb_submit_urb(0) ret -28
[71315.540861] /build/buildd/linux-ubuntu-modules-2.6.24-2.6.24/debian/build/build-generic/media/gspcav1/gspca_core.c: init isoc: usb_submit_urb(0) ret -28
[71324.257182] /build/buildd/linux-ubuntu-modules-2.6.24-2.6.24/debian/build/build-generic/media/gspcav1/gspca_core.c: init isoc: usb_submit_urb(0) ret -28
[71332.997555] /build/buildd/linux-ubuntu-modules-2.6.24-2.6.24/debian/build/build-generic/media/gspcav1/gspca_core.c: init isoc: usb_submit_urb(0) ret -28
[71402.285507] /build/buildd/linux-ubuntu-modules-2.6.24-2.6.24/debian/build/build-generic/media/gspcav1/gspca_core.c: init isoc: usb_submit_urb(0) ret -28
[71422.586572] /build/buildd/linux-ubuntu-modules-2.6.24-2.6.24/debian/build/build-generic/media/gspcav1/gspca_core.c: init isoc: usb_submit_urb(0) ret -28
[71442.851758] /build/buildd/linux-ubuntu-modules-2.6.24-2.6.24/debian/build/build-generic/media/gspcav1/gspca_core.c: init isoc: usb_submit_urb(0) ret -28
[71451.705732] /build/buildd/linux-ubuntu-modules-2.6.24-2.6.24/debian/build/build-generic/media/gspcav1/gspca_core.c: init isoc: usb_submit_urb(0) ret -28
[71460.535854] /build/buildd/linux-ubuntu-modules-2.6.24-2.6.24/debian/build/build-generic/media/gspcav1/gspca_core.c: init isoc: usb_submit_urb(0) ret -28
[71567.953183] usb 1-1: USB disconnect, address 3
[71573.906531] usb 1-1: new full speed USB device using uhci_hcd and address 5
[71574.117129] usb 1-1: configuration #1 chosen from 1 choice
[71574.128925] /build/buildd/linux-ubuntu-modules-2.6.24-2.6.24/debian/build/build-generic/media/gspcav1/gspca_core.c: USB GSPCA camera found.(ZC3XX) 
[71590.450659] /build/buildd/linux-ubuntu-modules-2.6.24-2.6.24/debian/build/build-generic/media/gspcav1/gspca_core.c: init isoc: usb_submit_urb(0) ret -28
[71624.797790] /build/buildd/linux-ubuntu-modules-2.6.24-2.6.24/debian/build/build-generic/media/gspcav1/gspca_core.c: init isoc: usb_submit_urb(0) ret -28
[71645.009035] /build/buildd/linux-ubuntu-modules-2.6.24-2.6.24/debian/build/build-generic/media/gspcav1/gspca_core.c: init isoc: usb_submit_urb(0) ret -28
[71665.217274] /build/buildd/linux-ubuntu-modules-2.6.24-2.6.24/debian/build/build-generic/media/gspcav1/gspca_core.c: init isoc: usb_submit_urb(0) ret -28
[71673.861696] /build/buildd/linux-ubuntu-modules-2.6.24-2.6.24/debian/build/build-generic/media/gspcav1/gspca_core.c: init isoc: usb_submit_urb(0) ret -28
[71682.714721] /build/buildd/linux-ubuntu-modules-2.6.24-2.6.24/debian/build/build-generic/media/gspcav1/gspca_core.c: init isoc: usb_submit_urb(0) ret -28
[71801.371178] /build/buildd/linux-ubuntu-modules-2.6.24-2.6.24/debian/build/build-generic/media/gspcav1/gspca_core.c: init isoc: usb_submit_urb(0) ret -28
[71821.666246] /build/buildd/linux-ubuntu-modules-2.6.24-2.6.24/debian/build/build-generic/media/gspcav1/gspca_core.c: init isoc: usb_submit_urb(0) ret -28
[71841.882479] /build/buildd/linux-ubuntu-modules-2.6.24-2.6.24/debian/build/build-generic/media/gspcav1/gspca_core.c: init isoc: usb_submit_urb(0) ret -28
[71850.526902] /build/buildd/linux-ubuntu-modules-2.6.24-2.6.24/debian/build/build-generic/media/gspcav1/gspca_core.c: init isoc: usb_submit_urb(0) ret -28
[71859.236200] /build/buildd/linux-ubuntu-modules-2.6.24-2.6.24/debian/build/build-generic/media/gspcav1/gspca_core.c: init isoc: usb_submit_urb(0) ret -28
[72035.297560] /build/buildd/linux-ubuntu-modules-2.6.24-2.6.24/debian/build/build-generic/media/gspcav1/gspca_core.c: init isoc: usb_submit_urb(0) ret -28
[72056.868045] /build/buildd/linux-ubuntu-modules-2.6.24-2.6.24/debian/build/build-generic/media/gspcav1/gspca_core.c: init isoc: usb_submit_urb(0) ret -28
[72080.585708] /build/buildd/linux-ubuntu-modules-2.6.24-2.6.24/debian/build/build-generic/media/gspcav1/gspca_core.c: init isoc: usb_submit_urb(0) ret -28
[72121.811654] /build/buildd/linux-ubuntu-modules-2.6.24-2.6.24/debian/build/build-generic/media/gspcav1/gspca_core.c: init isoc: usb_submit_urb(0) ret -28
[72126.132721] /build/buildd/linux-ubuntu-modules-2.6.24-2.6.24/debian/build/build-generic/media/gspcav1/gspca_core.c: VIDIOCMCAPTURE: invalid format (7)
[72130.456069] /build/buildd/linux-ubuntu-modules-2.6.24-2.6.24/debian/build/build-generic/media/gspcav1/gspca_core.c: init isoc: usb_submit_urb(0) ret -28
[72134.883878] /build/buildd/linux-ubuntu-modules-2.6.24-2.6.24/debian/build/build-generic/media/gspcav1/gspca_core.c: VIDIOCMCAPTURE: invalid format (9)
[72134.884099] /build/buildd/linux-ubuntu-modules-2.6.24-2.6.24/debian/build/build-generic/media/gspcav1/gspca_core.c: VIDIOCMCAPTURE: invalid format (14)
[72134.884310] /build/buildd/linux-ubuntu-modules-2.6.24-2.6.24/debian/build/build-generic/media/gspcav1/gspca_core.c: VIDIOCMCAPTURE: invalid format (13)
[72134.884520] /build/buildd/linux-ubuntu-modules-2.6.24-2.6.24/debian/build/build-generic/media/gspcav1/gspca_core.c: VIDIOCMCAPTURE: invalid format (16)
[72134.884731] /build/buildd/linux-ubuntu-modules-2.6.24-2.6.24/debian/build/build-generic/media/gspcav1/gspca_core.c: VIDIOCMCAPTURE: invalid format (11)
[72134.884943] /build/buildd/linux-ubuntu-modules-2.6.24-2.6.24/debian/build/build-generic/media/gspcav1/gspca_core.c: VIDIOCMCAPTURE: invalid format (6)
[72234.894793] /build/buildd/linux-ubuntu-modules-2.6.24-2.6.24/debian/build/build-generic/media/gspcav1/gspca_core.c: init isoc: usb_submit_urb(0) ret -28
[72255.137963] /build/buildd/linux-ubuntu-modules-2.6.24-2.6.24/debian/build/build-generic/media/gspcav1/gspca_core.c: init isoc: usb_submit_urb(0) ret -28
[72275.382141] /build/buildd/linux-ubuntu-modules-2.6.24-2.6.24/debian/build/build-generic/media/gspcav1/gspca_core.c: init isoc: usb_submit_urb(0) ret -28
[72284.254122] /build/buildd/linux-ubuntu-modules-2.6.24-2.6.24/debian/build/build-generic/media/gspcav1/gspca_core.c: init isoc: usb_submit_urb(0) ret -28
[72629.391249] /build/buildd/linux-ubuntu-modules-2.6.24-2.6.24/debian/build/build-generic/media/gspcav1/gspca_core.c: init isoc: usb_submit_urb(0) ret -28
[72649.607478] /build/buildd/linux-ubuntu-modules-2.6.24-2.6.24/debian/build/build-generic/media/gspcav1/gspca_core.c: init isoc: usb_submit_urb(0) ret -28
[72670.087203] /build/buildd/linux-ubuntu-modules-2.6.24-2.6.24/debian/build/build-generic/media/gspcav1/gspca_core.c: init isoc: usb_submit_urb(0) ret -28
[72678.859538] /build/buildd/linux-ubuntu-modules-2.6.24-2.6.24/debian/build/build-generic/media/gspcav1/gspca_core.c: init isoc: usb_submit_urb(0) ret -28
[72687.667488] /build/buildd/linux-ubuntu-modules-2.6.24-2.6.24/debian/build/build-generic/media/gspcav1/gspca_core.c: init isoc: usb_submit_urb(0) ret -28
[72994.696688] /build/buildd/linux-ubuntu-modules-2.6.24-2.6.24/debian/build/build-generic/media/gspcav1/gspca_core.c: init isoc: usb_submit_urb(0) ret -28
[84752.397406] tda1004x: setting up plls for 48MHz sampling clock
[84752.680878] tda1004x: found firmware revision 20 -- ok
[84760.818386] tda1004x: setting up plls for 48MHz sampling clock
[84761.101874] tda1004x: found firmware revision 20 -- ok
[94714.922392] tda1004x: setting up plls for 48MHz sampling clock
[94715.205877] tda1004x: found firmware revision 20 -- ok
[94718.895303] tda1004x: setting up plls for 48MHz sampling clock
[94719.178798] tda1004x: found firmware revision 20 -- ok
[137291.094358] /build/buildd/linux-ubuntu-modules-2.6.24-2.6.24/debian/build/build-generic/media/gspcav1/gspca_core.c: init isoc: usb_submit_urb(0) ret -28
[137560.426846] /build/buildd/linux-ubuntu-modules-2.6.24-2.6.24/debian/build/build-generic/media/gspcav1/gspca_core.c: init isoc: usb_submit_urb(0) ret -28
[137581.996481] /build/buildd/linux-ubuntu-modules-2.6.24-2.6.24/debian/build/build-generic/media/gspcav1/gspca_core.c: init isoc: usb_submit_urb(0) ret -28
[137603.657942] /build/buildd/linux-ubuntu-modules-2.6.24-2.6.24/debian/build/build-generic/media/gspcav1/gspca_core.c: init isoc: usb_submit_urb(0) ret -28
[137625.299452] /build/buildd/linux-ubuntu-modules-2.6.24-2.6.24/debian/build/build-generic/media/gspcav1/gspca_core.c: init isoc: usb_submit_urb(0) ret -28
[137646.928959] /build/buildd/linux-ubuntu-modules-2.6.24-2.6.24/debian/build/build-generic/media/gspcav1/gspca_core.c: init isoc: usb_submit_urb(0) ret -28
[137668.490609] /build/buildd/linux-ubuntu-modules-2.6.24-2.6.24/debian/build/build-generic/media/gspcav1/gspca_core.c: init isoc: usb_submit_urb(0) ret -28
[137690.052258] /build/buildd/linux-ubuntu-modules-2.6.24-2.6.24/debian/build/build-generic/media/gspcav1/gspca_core.c: init isoc: usb_submit_urb(0) ret -28
[137710.423195] /build/buildd/linux-ubuntu-modules-2.6.24-2.6.24/debian/build/build-generic/media/gspcav1/gspca_core.c: init isoc: usb_submit_urb(0) ret -28
[137731.010713] /build/buildd/linux-ubuntu-modules-2.6.24-2.6.24/debian/build/build-generic/media/gspcav1/gspca_core.c: init isoc: usb_submit_urb(0) ret -28
[137751.222952] /build/buildd/linux-ubuntu-modules-2.6.24-2.6.24/debian/build/build-generic/media/gspcav1/gspca_core.c: init isoc: usb_submit_urb(0) ret -28
[137771.532047] /build/buildd/linux-ubuntu-modules-2.6.24-2.6.24/debian/build/build-generic/media/gspcav1/gspca_core.c: init isoc: usb_submit_urb(0) ret -28
[137780.454893] /build/buildd/linux-ubuntu-modules-2.6.24-2.6.24/debian/build/build-generic/media/gspcav1/gspca_core.c: init isoc: usb_submit_urb(0) ret -28
[137790.208075] /build/buildd/linux-ubuntu-modules-2.6.24-2.6.24/debian/build/build-generic/media/gspcav1/gspca_core.c: init isoc: usb_submit_urb(0) ret -28
[139519.740844] nf_conntrack version 0.5.0 (10240 buckets, 40960 max)
[140637.716520] /build/buildd/linux-ubuntu-modules-2.6.24-2.6.24/debian/build/build-generic/media/gspcav1/gspca_core.c: init isoc: usb_submit_urb(0) ret -28
[140659.344947] /build/buildd/linux-ubuntu-modules-2.6.24-2.6.24/debian/build/build-generic/media/gspcav1/gspca_core.c: init isoc: usb_submit_urb(0) ret -28
[140683.568549] /build/buildd/linux-ubuntu-modules-2.6.24-2.6.24/debian/build/build-generic/media/gspcav1/gspca_core.c: init isoc: usb_submit_urb(0) ret -28
[140726.804615] /build/buildd/linux-ubuntu-modules-2.6.24-2.6.24/debian/build/build-generic/media/gspcav1/gspca_core.c: init isoc: usb_submit_urb(0) ret -28
[140731.129699] /build/buildd/linux-ubuntu-modules-2.6.24-2.6.24/debian/build/build-generic/media/gspcav1/gspca_core.c: VIDIOCMCAPTURE: invalid format (7)
[140735.465968] /build/buildd/linux-ubuntu-modules-2.6.24-2.6.24/debian/build/build-generic/media/gspcav1/gspca_core.c: init isoc: usb_submit_urb(0) ret -28
[140739.852744] /build/buildd/linux-ubuntu-modules-2.6.24-2.6.24/debian/build/build-generic/media/gspcav1/gspca_core.c: VIDIOCMCAPTURE: invalid format (9)
[140739.852971] /build/buildd/linux-ubuntu-modules-2.6.24-2.6.24/debian/build/build-generic/media/gspcav1/gspca_core.c: VIDIOCMCAPTURE: invalid format (14)
[140739.853185] /build/buildd/linux-ubuntu-modules-2.6.24-2.6.24/debian/build/build-generic/media/gspcav1/gspca_core.c: VIDIOCMCAPTURE: invalid format (13)
[140739.853398] /build/buildd/linux-ubuntu-modules-2.6.24-2.6.24/debian/build/build-generic/media/gspcav1/gspca_core.c: VIDIOCMCAPTURE: invalid format (16)
[140739.853611] /build/buildd/linux-ubuntu-modules-2.6.24-2.6.24/debian/build/build-generic/media/gspcav1/gspca_core.c: VIDIOCMCAPTURE: invalid format (11)
[140739.853824] /build/buildd/linux-ubuntu-modules-2.6.24-2.6.24/debian/build/build-generic/media/gspcav1/gspca_core.c: VIDIOCMCAPTURE: invalid format (6)
[140919.596003] usb 1-1: USB disconnect, address 5
[140929.737900] usb 1-1: new full speed USB device using uhci_hcd and address 6
[140929.946166] usb 1-1: configuration #1 chosen from 1 choice
[140929.953607] /build/buildd/linux-ubuntu-modules-2.6.24-2.6.24/debian/build/build-generic/media/gspcav1/gspca_core.c: USB GSPCA camera found.(ZC3XX) 
[140946.277697] /build/buildd/linux-ubuntu-modules-2.6.24-2.6.24/debian/build/build-generic/media/gspcav1/gspca_core.c: init isoc: usb_submit_urb(0) ret -28
[141333.461561] usbcore: deregistering interface driver gspca
[141333.464325] /build/buildd/linux-ubuntu-modules-2.6.24-2.6.24/debian/build/build-generic/media/gspcav1/gspca_core.c: driver gspca deregistered
[141374.521052] /build/buildd/linux-ubuntu-modules-2.6.24-2.6.24/debian/build/build-generic/media/gspcav1/gspca_core.c: USB GSPCA camera found.(ZC3XX) 
[141374.897914] usbcore: registered new interface driver gspca
[141374.897928] /build/buildd/linux-ubuntu-modules-2.6.24-2.6.24/debian/build/build-generic/media/gspcav1/gspca_core.c: gspca driver 01.00.20 registered
[141390.822169] /build/buildd/linux-ubuntu-modules-2.6.24-2.6.24/debian/build/build-generic/media/gspcav1/gspca_core.c: init isoc: usb_submit_urb(0) ret -28
[141697.506194] usbcore: deregistering interface driver gspca
[141697.508908] /build/buildd/linux-ubuntu-modules-2.6.24-2.6.24/debian/build/build-generic/media/gspcav1/gspca_core.c: driver gspca deregistered
[141731.088094] /build/buildd/linux-ubuntu-modules-2.6.24-2.6.24/debian/build/build-generic/media/gspcav1/gspca_core.c: USB GSPCA camera found.(ZC3XX) 
[141731.469000] usbcore: registered new interface driver gspca
[141731.469011] /build/buildd/linux-ubuntu-modules-2.6.24-2.6.24/debian/build/build-generic/media/gspcav1/gspca_core.c: gspca driver 01.00.20 registered
[141747.363442] /build/buildd/linux-ubuntu-modules-2.6.24-2.6.24/debian/build/build-generic/media/gspcav1/gspca_core.c: init isoc: usb_submit_urb(0) ret -28
[141914.227079] usbcore: deregistering interface driver gspca
[141914.230321] /build/buildd/linux-ubuntu-modules-2.6.24-2.6.24/debian/build/build-generic/media/gspcav1/gspca_core.c: driver gspca deregistered
[141938.996199] /build/buildd/linux-ubuntu-modules-2.6.24-2.6.24/debian/build/build-generic/media/gspcav1/gspca_core.c: USB GSPCA camera found.(ZC3XX) 
[141939.364309] usbcore: registered new interface driver gspca
[141939.364320] /build/buildd/linux-ubuntu-modules-2.6.24-2.6.24/debian/build/build-generic/media/gspcav1/gspca_core.c: gspca driver 01.00.20 registered
[141955.292748] /build/buildd/linux-ubuntu-modules-2.6.24-2.6.24/debian/build/build-generic/media/gspcav1/gspca_core.c: init isoc: usb_submit_urb(0) ret -28
[144439.445722] /build/buildd/linux-ubuntu-modules-2.6.24-2.6.24/debian/build/build-generic/media/gspcav1/gspca_core.c: init isoc: usb_submit_urb(0) ret -28
[144461.003383] /build/buildd/linux-ubuntu-modules-2.6.24-2.6.24/debian/build/build-generic/media/gspcav1/gspca_core.c: init isoc: usb_submit_urb(0) ret -28
[144485.156066] /build/buildd/linux-ubuntu-modules-2.6.24-2.6.24/debian/build/build-generic/media/gspcav1/gspca_core.c: init isoc: usb_submit_urb(0) ret -28
flo@zigzag:~$

a noter que ma cam est donc sur dev/video1 car j'ai un varte tv surement sur dev/video0

quand je lance ma cam sur amsn le contact  voi tout blanc moi j'ai rien et quand il arrete ma cam j'ai ma cam qui s'affiche mais ecran figé mais avec ma tête dc je ne c plus quoi faire peut etre reinstaller amsn donc voila si tu peux m'aider car je vien juste de me lancer sous linux j'ai le dernier ubuntu c super sauf quand ta copine est loin et qu elle hurle:" pourquoi tu as enlever windows plus rien marche on ne peux même plus se faire des cam t trop con"

voila pour la perinité de mon couple ft que cette cam marche

#19 Re : -1 »  [Clos] Centralisation Probleme Webcam+EasyCam » Le 03/08/2008, à 18:09

richon
Réponses : 2370

je precise juste que quand je lance ma cam moi je voi rien mon contact non plus puis au bout d'un moment j'ai le message diffusion de votre cam a était arreté et là je voi une fenetre qui s'ouvre avec ma tête mais en image figé donc il voi bien ma cam etc...

#20 Re : -1 »  [Clos] Centralisation Probleme Webcam+EasyCam » Le 03/08/2008, à 18:12

richon
Réponses : 2370

je poste mon dmesg juste apres l'essai d'envoyer ma cam

[   20.775852] ehci_hcd 0000:00:1d.7: EHCI Host Controller
[   20.775893] ehci_hcd 0000:00:1d.7: new USB bus registered, assigned bus number 4
[   20.779810] ehci_hcd 0000:00:1d.7: debug port 1
[   20.779819] PCI: cache line size of 128 is not supported by device 0000:00:1d.7
[   20.779832] ehci_hcd 0000:00:1d.7: irq 19, io mem 0xfe300000
[   20.807508] usb 1-1: new full speed USB device using uhci_hcd and address 2
[   20.819466] ehci_hcd 0000:00:1d.7: USB 2.0 started, EHCI 1.00, driver 10 Dec 2004
[   20.819657] usb usb4: configuration #1 chosen from 1 choice
[   20.819696] hub 4-0:1.0: USB hub found
[   20.819707] hub 4-0:1.0: 6 ports detected
[   20.923665] ACPI: PCI Interrupt 0000:02:09.0[A] -> GSI 18 (level, low) -> IRQ 18
[   20.923710] skge 1.13 addr 0xfe1f8000 irq 18 chip Yukon rev 1
[   20.924120] skge eth0: addr 00:30:bd:b2:6b:89
[   20.931689] PCI: Enabling device 0000:00:1f.1 (0005 -> 0007)
[   20.931701] ACPI: PCI Interrupt 0000:00:1f.1[A] -> GSI 18 (level, low) -> IRQ 18
[   20.931771] PCI: Setting latency timer of device 0000:00:1f.1 to 64
[   20.931789] ACPI: PCI interrupt for device 0000:00:1f.1 disabled
[   20.938712] ata_piix 0000:00:1f.1: version 2.12
[   20.938740] ACPI: PCI Interrupt 0000:00:1f.1[A] -> GSI 18 (level, low) -> IRQ 18
[   20.938811] PCI: Setting latency timer of device 0000:00:1f.1 to 64
[   20.940580] scsi0 : ata_piix
[   20.941790] scsi1 : ata_piix
[   20.941860] ata1: PATA max UDMA/100 cmd 0x1f0 ctl 0x3f6 bmdma 0xffa0 irq 14
[   20.941864] ata2: PATA max UDMA/100 cmd 0x170 ctl 0x376 bmdma 0xffa8 irq 15
[   21.103529] ata1.00: ATA-7: Maxtor 6E040L0, NAR61590, max UDMA/133
[   21.103535] ata1.00: 80293248 sectors, multi 8: LBA 
[   21.119356] ata1.00: configured for UDMA/100
[   21.430830] ata2.00: ATAPI: LITEON  DVD-ROM LTD163, GDHG, max UDMA/33
[   21.594321] ata2.00: configured for UDMA/33
[   21.594499] scsi 0:0:0:0: Direct-Access     ATA      Maxtor 6E040L0   NAR6 PQ: 0 ANSI: 5
[   21.594881] scsi 1:0:0:0: CD-ROM            LITEON   DVD-ROM LTD163   GDHG PQ: 0 ANSI: 5
[   21.609164] Driver 'sd' needs updating - please use bus_type methods
[   21.609294] sd 0:0:0:0: [sda] 80293248 512-byte hardware sectors (41110 MB)
[   21.609314] sd 0:0:0:0: [sda] Write Protect is off
[   21.609318] sd 0:0:0:0: [sda] Mode Sense: 00 3a 00 00
[   21.609347] sd 0:0:0:0: [sda] Write cache: enabled, read cache: enabled, doesn't support DPO or FUA
[   21.609418] sd 0:0:0:0: [sda] 80293248 512-byte hardware sectors (41110 MB)
[   21.609435] sd 0:0:0:0: [sda] Write Protect is off
[   21.609438] sd 0:0:0:0: [sda] Mode Sense: 00 3a 00 00
[   21.609466] sd 0:0:0:0: [sda] Write cache: enabled, read cache: enabled, doesn't support DPO or FUA
[   21.609472]  sda:<4>Driver 'sr' needs updating - please use bus_type methods
[   21.617868]  sda1 sda2 sda3
[   21.632074] sd 0:0:0:0: [sda] Attached SCSI disk
[   21.640896] sr0: scsi3-mmc drive: 0x/48x cd/rw xa/form2 cdda tray
[   21.640903] Uniform CD-ROM driver Revision: 3.20
[   21.640980] sr 1:0:0:0: Attached scsi CD-ROM sr0
[   21.641408] sd 0:0:0:0: Attached scsi generic sg0 type 0
[   21.641439] sr 1:0:0:0: Attached scsi generic sg1 type 5
[   21.665976] usb 1-1: new full speed USB device using uhci_hcd and address 3
[   21.876213] usb 1-1: configuration #1 chosen from 1 choice
[   22.047785] Attempting manual resume
[   22.047791] swsusp: Resume From Partition 8:2
[   22.047794] PM: Checking swsusp image.
[   22.048091] PM: Resume from disk failed.
[   22.069701] EXT3-fs: INFO: recovery required on readonly filesystem.
[   22.069707] EXT3-fs: write access will be enabled during recovery.
[   22.117143] usb 1-2: new low speed USB device using uhci_hcd and address 4
[   22.294434] usb 1-2: configuration #1 chosen from 1 choice
[   22.342664] usbcore: registered new interface driver hiddev
[   22.356609] input: Logitech USB Receiver as /devices/pci0000:00/0000:00:1d.0/usb1/1-2/1-2:1.0/input/input1
[   22.364838] input,hidraw0: USB HID v1.10 Keyboard [Logitech USB Receiver] on usb-0000:00:1d.0-2
[   22.394725] input: Logitech USB Receiver as /devices/pci0000:00/0000:00:1d.0/usb1/1-2/1-2:1.1/input/input2
[   22.416655] input,hidraw1: USB HID v1.10 Mouse [Logitech USB Receiver] on usb-0000:00:1d.0-2
[   22.416681] usbcore: registered new interface driver usbhid
[   22.416687] /build/buildd/linux-2.6.24/drivers/hid/usbhid/hid-core.c: v2.6:USB HID core driver
[   23.624070] kjournald starting.  Commit interval 5 seconds
[   23.624096] EXT3-fs: sda1: orphan cleanup on readonly fs
[   23.624106] ext3_orphan_cleanup: deleting unreferenced inode 261196
[   23.624187] ext3_orphan_cleanup: deleting unreferenced inode 261197
[   23.624201] ext3_orphan_cleanup: deleting unreferenced inode 261195
[   23.624234] ext3_orphan_cleanup: deleting unreferenced inode 261194
[   23.624274] ext3_orphan_cleanup: deleting unreferenced inode 261193
[   23.624315] ext3_orphan_cleanup: deleting unreferenced inode 261191
[   23.624359] ext3_orphan_cleanup: deleting unreferenced inode 490748
[   23.624390] ext3_orphan_cleanup: deleting unreferenced inode 261146
[   23.624398] EXT3-fs: sda1: 8 orphan inodes deleted
[   23.624401] EXT3-fs: recovery complete.
[   23.691113] EXT3-fs: mounted filesystem with ordered data mode.
[   33.028922] pci_hotplug: PCI Hot Plug PCI Core version: 0.5
[   33.078327] shpchp: Standard Hot Plug PCI Controller Driver version: 0.4
[   33.178884] iTCO_vendor_support: vendor-support=0
[   33.224001] iTCO_wdt: Intel TCO WatchDog Timer Driver v1.02 (26-Jul-2007)
[   33.225396] iTCO_wdt: failed to reset NO_REBOOT flag, reboot disabled by hardware
[   33.225409] iTCO_wdt: No card detected
[   33.280019] Linux agpgart interface v0.102
[   33.365285] agpgart: Detected an Intel 830M Chipset.
[   33.369210] agpgart: AGP aperture is 64M @ 0xf0000000
[   33.417651] input: PC Speaker as /devices/platform/pcspkr/input/input3
[   33.536813] intel_rng: FWH not detected
[   33.910344] input: Power Button (FF) as /devices/virtual/input/input4
[   33.920166] ACPI: Power Button (FF) [PWRF]
[   33.920309] input: Power Button (CM) as /devices/virtual/input/input5
[   33.936095] ACPI: Power Button (CM) [VBTN]
[   34.858464] Linux video capture interface: v2.00
[   35.451673] nvidia: module license 'NVIDIA' taints kernel.
[   36.048457] parport_pc 00:07: reported by Plug and Play ACPI
[   36.048515] parport0: PC-style at 0x378 (0x778), irq 7, using FIFO [PCSPP,TRISTATE,COMPAT,ECP]
[   36.089657] bttv: driver version 0.9.17 loaded
[   36.089664] bttv: using 8 buffers with 2080k (520 pages) each for capture
[   36.089751] bttv: Bt8xx card found (0).
[   36.089781] ACPI: PCI Interrupt 0000:02:07.0[A] -> GSI 16 (level, low) -> IRQ 16
[   36.089796] bttv0: Bt878 (rev 17) at 0000:02:07.0, irq: 16, latency: 64, mmio: 0xf40ff000
[   36.091325] bttv0: detected: Pinnacle PCTV [bswap] [card=39], PCI subsystem ID is bd11:1200
[   36.091332] bttv0: using: Pinnacle PCTV Studio/Rave [card=39,autodetected]
[   36.091369] bttv0: gpio: en=00000000, out=00000000 in=00ff27ff [init]
[   36.095598] bttv0: i2c: checking for MSP34xx @ 0x80... not found
[   36.103615] bttv0: miro: id=9 tuner=3 radio=no stereo=no
[   36.103621] bttv0: tuner type=3
[   36.103626] bttv0: i2c: checking for MSP34xx @ 0x80... not found
[   36.104240] bttv0: i2c: checking for TDA9875 @ 0xb0... not found
[   36.105065] bttv0: i2c: checking for TDA7432 @ 0x8a... not found
[   36.152065] saa7130/34: v4l2 driver version 0.2.14 loaded
[   36.369100] All bytes are equal. It is not a TEA5767
[   36.369108] tuner 0-0060: chip found @ 0xc0 (bt878 #0 [sw])
[   36.369144] tuner-simple 0-0060: type set to 3 (Philips (SECAM+PAL_BG) (FI1216MF, FM1216MF, FR1216MF))
[   36.369149] tuner 0-0060: type set to Philips (SECAM+PAL_
[   36.369154] tuner-simple 0-0060: type set to 3 (Philips (SECAM+PAL_BG) (FI1216MF, FM1216MF, FR1216MF))
[   36.369158] tuner 0-0060: type set to Philips (SECAM+PAL_
[   36.425341] bttv0: registered device video0
[   36.425373] bttv0: registered device vbi0
[   36.425398] bttv0: PLL: 28636363 => 35468950 .. ok
[   36.456971] ACPI: PCI Interrupt 0000:02:08.0[A] -> GSI 17 (level, low) -> IRQ 20
[   36.456984] saa7133[0]: found at 0000:02:08.0, rev: 209, irq: 20, latency: 64, mmio: 0xfe1ff800
[   36.456993] saa7133[0]: subsystem: 0070:6701, board: Hauppauge WinTV-HVR1110 DVB-T/Hybrid [card=104,autodetected]
[   36.457010] saa7133[0]: board init: gpio is 6400000
[   36.559863] dcdbas dcdbas: Dell Systems Management Base Driver (version 5.6.0-3.2)
[   36.583506] input: HVR 1110 as /devices/virtual/input/input6
[   36.586390] bt878: AUDIO driver version 0.0.0 loaded
[   36.595413] ir-kbd-i2c: HVR 1110 detected at i2c-1/1-0071/ir0 [saa7133[0]]
[   36.667234] tuner 1-004b: chip found @ 0x96 (saa7133[0])
[   36.715123] tda8290 1-004b: setting tuner address to 61
[   36.822935] tuner 1-004b: type set to tda8290+75a
[   36.870842] tda8290 1-004b: setting tuner address to 61
[   36.974666] tuner 1-004b: type set to tda8290+75a
[   37.006600] saa7133[0]: i2c eeprom 00: 70 00 01 67 54 20 1c 00 43 43 a9 1c 55 d2 b2 92
[   37.006616] saa7133[0]: i2c eeprom 10: ff ff ff 0e ff 20 ff ff ff ff ff ff ff ff ff ff
[   37.006630] saa7133[0]: i2c eeprom 20: 01 40 01 32 32 01 01 33 88 ff 00 aa ff ff ff ff
[   37.006644] saa7133[0]: i2c eeprom 30: ff ff ff ff ff ff ff ff ff ff ff ff ff ff ff ff
[   37.006657] saa7133[0]: i2c eeprom 40: ff 21 00 c2 96 10 03 32 15 60 ff ff ff ff ff ff
[   37.006670] saa7133[0]: i2c eeprom 50: ff 00 00 00 00 00 00 00 00 00 00 00 00 00 00 00
[   37.006683] saa7133[0]: i2c eeprom 60: 00 00 00 00 00 00 00 00 00 00 00 00 00 00 00 00
[   37.006696] saa7133[0]: i2c eeprom 70: 00 00 00 00 00 00 00 00 00 00 00 00 00 00 00 00
[   37.177835] /build/buildd/linux-ubuntu-modules-2.6.24-2.6.24/debian/build/build-generic/media/gspcav1/gspca_core.c: USB GSPCA camera found.(ZC3XX) 
[   37.564173] usbcore: registered new interface driver gspca
[   37.564182] /build/buildd/linux-ubuntu-modules-2.6.24-2.6.24/debian/build/build-generic/media/gspcav1/gspca_core.c: gspca driver 01.00.20 registered
[   37.684216] usbcore: registered new interface driver snd-usb-audio
[   39.222748] saa7133[0]: registered device video2 [v4l2]
[   39.222779] saa7133[0]: registered device vbi1
[   39.222805] saa7133[0]: registered device radio0
[   39.286717] bt878: Bt878 AUDIO function found (0).
[   39.286745] ACPI: PCI Interrupt 0000:02:07.1[A] -> GSI 16 (level, low) -> IRQ 16
[   39.286755] bt878_probe: card id=[0x1200bd11], Unknown card.
[   39.286757] Exiting..
[   39.286762] ACPI: PCI interrupt for device 0000:02:07.1 disabled
[   39.286771] bt878: probe of 0000:02:07.1 failed with error -22
[   39.290685] ACPI: PCI Interrupt 0000:01:00.0[A] -> GSI 16 (level, low) -> IRQ 16
[   39.291191] NVRM: loading NVIDIA Linux x86 Kernel Module  96.43.05  Tue Jan 22 19:36:58 PST 2008
[   39.291874] ACPI: PCI Interrupt 0000:02:0a.0[A] -> GSI 19 (level, low) -> IRQ 17
[   39.387680] ACPI: PCI Interrupt 0000:02:07.1[A] -> GSI 16 (level, low) -> IRQ 16
[   39.388178] ALSA /build/buildd/linux-ubuntu-modules-2.6.24-2.6.24/debian/build/build-generic/sound/alsa-driver/pci/bt87x.c:947: bt87x0: Using board 1, analog, digital (rate 32000 Hz)
[   39.406716] saa7134 ALSA driver for DMA sound loaded
[   39.406760] saa7133[0]/alsa: saa7133[0] at 0xfe1ff800 irq 20 registered as card -2
[   39.616338] DVB: registering new adapter (saa7133[0])
[   39.616346] DVB: registering frontend 0 (Philips TDA10046H DVB-T)...
[   39.685827] tda1004x: setting up plls for 48MHz sampling clock
[   40.563103] loop: module loaded
[   40.604294] lp0: using parport0 (interrupt-driven).
[   40.712120] Adding 979956k swap on /dev/sda2.  Priority:-1 extents:1 across:979956k
[   41.288609] EXT3 FS on sda1, internal journal
[   41.945797] tda1004x: timeout waiting for DSP ready
[   41.985726] tda1004x: found firmware revision 0 -- invalid
[   41.985732] tda1004x: trying to boot from eeprom
[   42.627670] kjournald starting.  Commit interval 5 seconds
[   42.627870] EXT3 FS on sda3, internal journal
[   42.627875] EXT3-fs: mounted filesystem with ordered data mode.
[   43.188964] ip_tables: (C) 2000-2006 Netfilter Core Team
[   43.738290] No dock devices found.
[   44.305661] tda1004x: timeout waiting for DSP ready
[   44.345535] tda1004x: found firmware revision 0 -- invalid
[   44.345543] tda1004x: waiting for firmware upload...
[   45.574713] apm: BIOS version 1.2 Flags 0x03 (Driver version 1.16ac)
[   45.574721] apm: overridden by ACPI.
[   45.756357] ppdev: user-space parallel port driver
[   45.957395] audit(1217634191.485:2): type=1503 operation="inode_permission" requested_mask="a::" denied_mask="a::" name="/dev/tty" pid=4881 profile="/usr/sbin/cupsd" namespace="default"
[   56.979011] tda1004x: found firmware revision 20 -- ok
[   63.557147] /build/buildd/linux-ubuntu-modules-2.6.24-2.6.24/debian/build/build-generic/media/gspcav1/gspca_core.c: init isoc: usb_submit_urb(0) ret -28
[   72.510298] skge eth0: enabling interface
[   72.642243] Bluetooth: Core ver 2.11
[   72.643960] NET: Registered protocol family 31
[   72.643967] Bluetooth: HCI device and connection manager initialized
[   72.643973] Bluetooth: HCI socket layer initialized
[   72.667160] Bluetooth: L2CAP ver 2.9
[   72.667167] Bluetooth: L2CAP socket layer initialized
[   72.748093] Bluetooth: RFCOMM socket layer initialized
[   72.748118] Bluetooth: RFCOMM TTY layer initialized
[   72.748121] Bluetooth: RFCOMM ver 1.8
[   74.775874] agpgart: Found an AGP 2.0 compliant device at 0000:00:00.0.
[   74.776258] agpgart: Putting AGP V2 device at 0000:00:00.0 into 4x mode
[   74.776517] agpgart: Putting AGP V2 device at 0000:01:00.0 into 4x mode
[   75.513340] skge eth0: Link is up at 100 Mbps, full duplex, flow control both
[   77.673659] NET: Registered protocol family 17
[   90.177153] NET: Registered protocol family 10
[   90.177865] lo: Disabled Privacy Extensions
[  100.837584] eth0: no IPv6 routers present
[ 2665.581795] tda1004x: setting up plls for 48MHz sampling clock
[ 2665.865292] tda1004x: found firmware revision 20 -- ok
[ 2671.507238] tda1004x: setting up plls for 48MHz sampling clock
[ 2671.790735] tda1004x: found firmware revision 20 -- ok
[ 2871.526844] tda1004x: setting up plls for 48MHz sampling clock
[ 2871.810359] tda1004x: found firmware revision 20 -- ok
[57805.123420] tda1004x: setting up plls for 48MHz sampling clock
[57805.406938] tda1004x: found firmware revision 20 -- ok
[57819.945012] tda1004x: setting up plls for 48MHz sampling clock
[57820.228504] tda1004x: found firmware revision 20 -- ok
[71274.956690] /build/buildd/linux-ubuntu-modules-2.6.24-2.6.24/debian/build/build-generic/media/gspcav1/gspca_core.c: init isoc: usb_submit_urb(0) ret -28
[71295.212845] /build/buildd/linux-ubuntu-modules-2.6.24-2.6.24/debian/build/build-generic/media/gspcav1/gspca_core.c: init isoc: usb_submit_urb(0) ret -28
[71315.540861] /build/buildd/linux-ubuntu-modules-2.6.24-2.6.24/debian/build/build-generic/media/gspcav1/gspca_core.c: init isoc: usb_submit_urb(0) ret -28
[71324.257182] /build/buildd/linux-ubuntu-modules-2.6.24-2.6.24/debian/build/build-generic/media/gspcav1/gspca_core.c: init isoc: usb_submit_urb(0) ret -28
[71332.997555] /build/buildd/linux-ubuntu-modules-2.6.24-2.6.24/debian/build/build-generic/media/gspcav1/gspca_core.c: init isoc: usb_submit_urb(0) ret -28
[71402.285507] /build/buildd/linux-ubuntu-modules-2.6.24-2.6.24/debian/build/build-generic/media/gspcav1/gspca_core.c: init isoc: usb_submit_urb(0) ret -28
[71422.586572] /build/buildd/linux-ubuntu-modules-2.6.24-2.6.24/debian/build/build-generic/media/gspcav1/gspca_core.c: init isoc: usb_submit_urb(0) ret -28
[71442.851758] /build/buildd/linux-ubuntu-modules-2.6.24-2.6.24/debian/build/build-generic/media/gspcav1/gspca_core.c: init isoc: usb_submit_urb(0) ret -28
[71451.705732] /build/buildd/linux-ubuntu-modules-2.6.24-2.6.24/debian/build/build-generic/media/gspcav1/gspca_core.c: init isoc: usb_submit_urb(0) ret -28
[71460.535854] /build/buildd/linux-ubuntu-modules-2.6.24-2.6.24/debian/build/build-generic/media/gspcav1/gspca_core.c: init isoc: usb_submit_urb(0) ret -28
[71567.953183] usb 1-1: USB disconnect, address 3
[71573.906531] usb 1-1: new full speed USB device using uhci_hcd and address 5
[71574.117129] usb 1-1: configuration #1 chosen from 1 choice
[71574.128925] /build/buildd/linux-ubuntu-modules-2.6.24-2.6.24/debian/build/build-generic/media/gspcav1/gspca_core.c: USB GSPCA camera found.(ZC3XX) 
[71590.450659] /build/buildd/linux-ubuntu-modules-2.6.24-2.6.24/debian/build/build-generic/media/gspcav1/gspca_core.c: init isoc: usb_submit_urb(0) ret -28
[71624.797790] /build/buildd/linux-ubuntu-modules-2.6.24-2.6.24/debian/build/build-generic/media/gspcav1/gspca_core.c: init isoc: usb_submit_urb(0) ret -28
[71645.009035] /build/buildd/linux-ubuntu-modules-2.6.24-2.6.24/debian/build/build-generic/media/gspcav1/gspca_core.c: init isoc: usb_submit_urb(0) ret -28
[71665.217274] /build/buildd/linux-ubuntu-modules-2.6.24-2.6.24/debian/build/build-generic/media/gspcav1/gspca_core.c: init isoc: usb_submit_urb(0) ret -28
[71673.861696] /build/buildd/linux-ubuntu-modules-2.6.24-2.6.24/debian/build/build-generic/media/gspcav1/gspca_core.c: init isoc: usb_submit_urb(0) ret -28
[71682.714721] /build/buildd/linux-ubuntu-modules-2.6.24-2.6.24/debian/build/build-generic/media/gspcav1/gspca_core.c: init isoc: usb_submit_urb(0) ret -28
[71801.371178] /build/buildd/linux-ubuntu-modules-2.6.24-2.6.24/debian/build/build-generic/media/gspcav1/gspca_core.c: init isoc: usb_submit_urb(0) ret -28
[71821.666246] /build/buildd/linux-ubuntu-modules-2.6.24-2.6.24/debian/build/build-generic/media/gspcav1/gspca_core.c: init isoc: usb_submit_urb(0) ret -28
[71841.882479] /build/buildd/linux-ubuntu-modules-2.6.24-2.6.24/debian/build/build-generic/media/gspcav1/gspca_core.c: init isoc: usb_submit_urb(0) ret -28
[71850.526902] /build/buildd/linux-ubuntu-modules-2.6.24-2.6.24/debian/build/build-generic/media/gspcav1/gspca_core.c: init isoc: usb_submit_urb(0) ret -28
[71859.236200] /build/buildd/linux-ubuntu-modules-2.6.24-2.6.24/debian/build/build-generic/media/gspcav1/gspca_core.c: init isoc: usb_submit_urb(0) ret -28
[72035.297560] /build/buildd/linux-ubuntu-modules-2.6.24-2.6.24/debian/build/build-generic/media/gspcav1/gspca_core.c: init isoc: usb_submit_urb(0) ret -28
[72056.868045] /build/buildd/linux-ubuntu-modules-2.6.24-2.6.24/debian/build/build-generic/media/gspcav1/gspca_core.c: init isoc: usb_submit_urb(0) ret -28
[72080.585708] /build/buildd/linux-ubuntu-modules-2.6.24-2.6.24/debian/build/build-generic/media/gspcav1/gspca_core.c: init isoc: usb_submit_urb(0) ret -28
[72121.811654] /build/buildd/linux-ubuntu-modules-2.6.24-2.6.24/debian/build/build-generic/media/gspcav1/gspca_core.c: init isoc: usb_submit_urb(0) ret -28
[72126.132721] /build/buildd/linux-ubuntu-modules-2.6.24-2.6.24/debian/build/build-generic/media/gspcav1/gspca_core.c: VIDIOCMCAPTURE: invalid format (7)
[72130.456069] /build/buildd/linux-ubuntu-modules-2.6.24-2.6.24/debian/build/build-generic/media/gspcav1/gspca_core.c: init isoc: usb_submit_urb(0) ret -28
[72134.883878] /build/buildd/linux-ubuntu-modules-2.6.24-2.6.24/debian/build/build-generic/media/gspcav1/gspca_core.c: VIDIOCMCAPTURE: invalid format (9)
[72134.884099] /build/buildd/linux-ubuntu-modules-2.6.24-2.6.24/debian/build/build-generic/media/gspcav1/gspca_core.c: VIDIOCMCAPTURE: invalid format (14)
[72134.884310] /build/buildd/linux-ubuntu-modules-2.6.24-2.6.24/debian/build/build-generic/media/gspcav1/gspca_core.c: VIDIOCMCAPTURE: invalid format (13)
[72134.884520] /build/buildd/linux-ubuntu-modules-2.6.24-2.6.24/debian/build/build-generic/media/gspcav1/gspca_core.c: VIDIOCMCAPTURE: invalid format (16)
[72134.884731] /build/buildd/linux-ubuntu-modules-2.6.24-2.6.24/debian/build/build-generic/media/gspcav1/gspca_core.c: VIDIOCMCAPTURE: invalid format (11)
[72134.884943] /build/buildd/linux-ubuntu-modules-2.6.24-2.6.24/debian/build/build-generic/media/gspcav1/gspca_core.c: VIDIOCMCAPTURE: invalid format (6)
[72234.894793] /build/buildd/linux-ubuntu-modules-2.6.24-2.6.24/debian/build/build-generic/media/gspcav1/gspca_core.c: init isoc: usb_submit_urb(0) ret -28
[72255.137963] /build/buildd/linux-ubuntu-modules-2.6.24-2.6.24/debian/build/build-generic/media/gspcav1/gspca_core.c: init isoc: usb_submit_urb(0) ret -28
[72275.382141] /build/buildd/linux-ubuntu-modules-2.6.24-2.6.24/debian/build/build-generic/media/gspcav1/gspca_core.c: init isoc: usb_submit_urb(0) ret -28
[72284.254122] /build/buildd/linux-ubuntu-modules-2.6.24-2.6.24/debian/build/build-generic/media/gspcav1/gspca_core.c: init isoc: usb_submit_urb(0) ret -28
[72629.391249] /build/buildd/linux-ubuntu-modules-2.6.24-2.6.24/debian/build/build-generic/media/gspcav1/gspca_core.c: init isoc: usb_submit_urb(0) ret -28
[72649.607478] /build/buildd/linux-ubuntu-modules-2.6.24-2.6.24/debian/build/build-generic/media/gspcav1/gspca_core.c: init isoc: usb_submit_urb(0) ret -28
[72670.087203] /build/buildd/linux-ubuntu-modules-2.6.24-2.6.24/debian/build/build-generic/media/gspcav1/gspca_core.c: init isoc: usb_submit_urb(0) ret -28
[72678.859538] /build/buildd/linux-ubuntu-modules-2.6.24-2.6.24/debian/build/build-generic/media/gspcav1/gspca_core.c: init isoc: usb_submit_urb(0) ret -28
[72687.667488] /build/buildd/linux-ubuntu-modules-2.6.24-2.6.24/debian/build/build-generic/media/gspcav1/gspca_core.c: init isoc: usb_submit_urb(0) ret -28
[72994.696688] /build/buildd/linux-ubuntu-modules-2.6.24-2.6.24/debian/build/build-generic/media/gspcav1/gspca_core.c: init isoc: usb_submit_urb(0) ret -28
[84752.397406] tda1004x: setting up plls for 48MHz sampling clock
[84752.680878] tda1004x: found firmware revision 20 -- ok
[84760.818386] tda1004x: setting up plls for 48MHz sampling clock
[84761.101874] tda1004x: found firmware revision 20 -- ok
[94714.922392] tda1004x: setting up plls for 48MHz sampling clock
[94715.205877] tda1004x: found firmware revision 20 -- ok
[94718.895303] tda1004x: setting up plls for 48MHz sampling clock
[94719.178798] tda1004x: found firmware revision 20 -- ok
[137291.094358] /build/buildd/linux-ubuntu-modules-2.6.24-2.6.24/debian/build/build-generic/media/gspcav1/gspca_core.c: init isoc: usb_submit_urb(0) ret -28
[137560.426846] /build/buildd/linux-ubuntu-modules-2.6.24-2.6.24/debian/build/build-generic/media/gspcav1/gspca_core.c: init isoc: usb_submit_urb(0) ret -28
[137581.996481] /build/buildd/linux-ubuntu-modules-2.6.24-2.6.24/debian/build/build-generic/media/gspcav1/gspca_core.c: init isoc: usb_submit_urb(0) ret -28
[137603.657942] /build/buildd/linux-ubuntu-modules-2.6.24-2.6.24/debian/build/build-generic/media/gspcav1/gspca_core.c: init isoc: usb_submit_urb(0) ret -28
[137625.299452] /build/buildd/linux-ubuntu-modules-2.6.24-2.6.24/debian/build/build-generic/media/gspcav1/gspca_core.c: init isoc: usb_submit_urb(0) ret -28
[137646.928959] /build/buildd/linux-ubuntu-modules-2.6.24-2.6.24/debian/build/build-generic/media/gspcav1/gspca_core.c: init isoc: usb_submit_urb(0) ret -28
[137668.490609] /build/buildd/linux-ubuntu-modules-2.6.24-2.6.24/debian/build/build-generic/media/gspcav1/gspca_core.c: init isoc: usb_submit_urb(0) ret -28
[137690.052258] /build/buildd/linux-ubuntu-modules-2.6.24-2.6.24/debian/build/build-generic/media/gspcav1/gspca_core.c: init isoc: usb_submit_urb(0) ret -28
[137710.423195] /build/buildd/linux-ubuntu-modules-2.6.24-2.6.24/debian/build/build-generic/media/gspcav1/gspca_core.c: init isoc: usb_submit_urb(0) ret -28
[137731.010713] /build/buildd/linux-ubuntu-modules-2.6.24-2.6.24/debian/build/build-generic/media/gspcav1/gspca_core.c: init isoc: usb_submit_urb(0) ret -28
[137751.222952] /build/buildd/linux-ubuntu-modules-2.6.24-2.6.24/debian/build/build-generic/media/gspcav1/gspca_core.c: init isoc: usb_submit_urb(0) ret -28
[137771.532047] /build/buildd/linux-ubuntu-modules-2.6.24-2.6.24/debian/build/build-generic/media/gspcav1/gspca_core.c: init isoc: usb_submit_urb(0) ret -28
[137780.454893] /build/buildd/linux-ubuntu-modules-2.6.24-2.6.24/debian/build/build-generic/media/gspcav1/gspca_core.c: init isoc: usb_submit_urb(0) ret -28
[137790.208075] /build/buildd/linux-ubuntu-modules-2.6.24-2.6.24/debian/build/build-generic/media/gspcav1/gspca_core.c: init isoc: usb_submit_urb(0) ret -28
[139519.740844] nf_conntrack version 0.5.0 (10240 buckets, 40960 max)
[140637.716520] /build/buildd/linux-ubuntu-modules-2.6.24-2.6.24/debian/build/build-generic/media/gspcav1/gspca_core.c: init isoc: usb_submit_urb(0) ret -28
[140659.344947] /build/buildd/linux-ubuntu-modules-2.6.24-2.6.24/debian/build/build-generic/media/gspcav1/gspca_core.c: init isoc: usb_submit_urb(0) ret -28
[140683.568549] /build/buildd/linux-ubuntu-modules-2.6.24-2.6.24/debian/build/build-generic/media/gspcav1/gspca_core.c: init isoc: usb_submit_urb(0) ret -28
[140726.804615] /build/buildd/linux-ubuntu-modules-2.6.24-2.6.24/debian/build/build-generic/media/gspcav1/gspca_core.c: init isoc: usb_submit_urb(0) ret -28
[140731.129699] /build/buildd/linux-ubuntu-modules-2.6.24-2.6.24/debian/build/build-generic/media/gspcav1/gspca_core.c: VIDIOCMCAPTURE: invalid format (7)
[140735.465968] /build/buildd/linux-ubuntu-modules-2.6.24-2.6.24/debian/build/build-generic/media/gspcav1/gspca_core.c: init isoc: usb_submit_urb(0) ret -28
[140739.852744] /build/buildd/linux-ubuntu-modules-2.6.24-2.6.24/debian/build/build-generic/media/gspcav1/gspca_core.c: VIDIOCMCAPTURE: invalid format (9)
[140739.852971] /build/buildd/linux-ubuntu-modules-2.6.24-2.6.24/debian/build/build-generic/media/gspcav1/gspca_core.c: VIDIOCMCAPTURE: invalid format (14)
[140739.853185] /build/buildd/linux-ubuntu-modules-2.6.24-2.6.24/debian/build/build-generic/media/gspcav1/gspca_core.c: VIDIOCMCAPTURE: invalid format (13)
[140739.853398] /build/buildd/linux-ubuntu-modules-2.6.24-2.6.24/debian/build/build-generic/media/gspcav1/gspca_core.c: VIDIOCMCAPTURE: invalid format (16)
[140739.853611] /build/buildd/linux-ubuntu-modules-2.6.24-2.6.24/debian/build/build-generic/media/gspcav1/gspca_core.c: VIDIOCMCAPTURE: invalid format (11)
[140739.853824] /build/buildd/linux-ubuntu-modules-2.6.24-2.6.24/debian/build/build-generic/media/gspcav1/gspca_core.c: VIDIOCMCAPTURE: invalid format (6)
[140919.596003] usb 1-1: USB disconnect, address 5
[140929.737900] usb 1-1: new full speed USB device using uhci_hcd and address 6
[140929.946166] usb 1-1: configuration #1 chosen from 1 choice
[140929.953607] /build/buildd/linux-ubuntu-modules-2.6.24-2.6.24/debian/build/build-generic/media/gspcav1/gspca_core.c: USB GSPCA camera found.(ZC3XX) 
[140946.277697] /build/buildd/linux-ubuntu-modules-2.6.24-2.6.24/debian/build/build-generic/media/gspcav1/gspca_core.c: init isoc: usb_submit_urb(0) ret -28
[141333.461561] usbcore: deregistering interface driver gspca
[141333.464325] /build/buildd/linux-ubuntu-modules-2.6.24-2.6.24/debian/build/build-generic/media/gspcav1/gspca_core.c: driver gspca deregistered
[141374.521052] /build/buildd/linux-ubuntu-modules-2.6.24-2.6.24/debian/build/build-generic/media/gspcav1/gspca_core.c: USB GSPCA camera found.(ZC3XX) 
[141374.897914] usbcore: registered new interface driver gspca
[141374.897928] /build/buildd/linux-ubuntu-modules-2.6.24-2.6.24/debian/build/build-generic/media/gspcav1/gspca_core.c: gspca driver 01.00.20 registered
[141390.822169] /build/buildd/linux-ubuntu-modules-2.6.24-2.6.24/debian/build/build-generic/media/gspcav1/gspca_core.c: init isoc: usb_submit_urb(0) ret -28
[141697.506194] usbcore: deregistering interface driver gspca
[141697.508908] /build/buildd/linux-ubuntu-modules-2.6.24-2.6.24/debian/build/build-generic/media/gspcav1/gspca_core.c: driver gspca deregistered
[141731.088094] /build/buildd/linux-ubuntu-modules-2.6.24-2.6.24/debian/build/build-generic/media/gspcav1/gspca_core.c: USB GSPCA camera found.(ZC3XX) 
[141731.469000] usbcore: registered new interface driver gspca
[141731.469011] /build/buildd/linux-ubuntu-modules-2.6.24-2.6.24/debian/build/build-generic/media/gspcav1/gspca_core.c: gspca driver 01.00.20 registered
[141747.363442] /build/buildd/linux-ubuntu-modules-2.6.24-2.6.24/debian/build/build-generic/media/gspcav1/gspca_core.c: init isoc: usb_submit_urb(0) ret -28
[141914.227079] usbcore: deregistering interface driver gspca
[141914.230321] /build/buildd/linux-ubuntu-modules-2.6.24-2.6.24/debian/build/build-generic/media/gspcav1/gspca_core.c: driver gspca deregistered
[141938.996199] /build/buildd/linux-ubuntu-modules-2.6.24-2.6.24/debian/build/build-generic/media/gspcav1/gspca_core.c: USB GSPCA camera found.(ZC3XX) 
[141939.364309] usbcore: registered new interface driver gspca
[141939.364320] /build/buildd/linux-ubuntu-modules-2.6.24-2.6.24/debian/build/build-generic/media/gspcav1/gspca_core.c: gspca driver 01.00.20 registered
[141955.292748] /build/buildd/linux-ubuntu-modules-2.6.24-2.6.24/debian/build/build-generic/media/gspcav1/gspca_core.c: init isoc: usb_submit_urb(0) ret -28
[144439.445722] /build/buildd/linux-ubuntu-modules-2.6.24-2.6.24/debian/build/build-generic/media/gspcav1/gspca_core.c: init isoc: usb_submit_urb(0) ret -28
[144461.003383] /build/buildd/linux-ubuntu-modules-2.6.24-2.6.24/debian/build/build-generic/media/gspcav1/gspca_core.c: init isoc: usb_submit_urb(0) ret -28
[144485.156066] /build/buildd/linux-ubuntu-modules-2.6.24-2.6.24/debian/build/build-generic/media/gspcav1/gspca_core.c: init isoc: usb_submit_urb(0) ret -28
[148185.767274] /build/buildd/linux-ubuntu-modules-2.6.24-2.6.24/debian/build/build-generic/media/gspcav1/gspca_core.c: init isoc: usb_submit_urb(0) ret -28
[148207.324934] /build/buildd/linux-ubuntu-modules-2.6.24-2.6.24/debian/build/build-generic/media/gspcav1/gspca_core.c: init isoc: usb_submit_urb(0) ret -28
[148228.925514] /build/buildd/linux-ubuntu-modules-2.6.24-2.6.24/debian/build/build-generic/media/gspcav1/gspca_core.c: init isoc: usb_submit_urb(0) ret -28
[148250.471194] /build/buildd/linux-ubuntu-modules-2.6.24-2.6.24/debian/build/build-generic/media/gspcav1/gspca_core.c: init isoc: usb_submit_urb(0) ret -28
[148272.116684] /build/buildd/linux-ubuntu-modules-2.6.24-2.6.24/debian/build/build-generic/media/gspcav1/gspca_core.c: init isoc: usb_submit_urb(0) ret -28
[148293.722252] /build/buildd/linux-ubuntu-modules-2.6.24-2.6.24/debian/build/build-generic/media/gspcav1/gspca_core.c: init isoc: usb_submit_urb(0) ret -28
[148315.418643] /build/buildd/linux-ubuntu-modules-2.6.24-2.6.24/debian/build/build-generic/media/gspcav1/gspca_core.c: init isoc: usb_submit_urb(0) ret -28
[148335.695755] /build/buildd/linux-ubuntu-modules-2.6.24-2.6.24/debian/build/build-generic/media/gspcav1/gspca_core.c: init isoc: usb_submit_urb(0) ret -28
[148449.316889] /build/buildd/linux-ubuntu-modules-2.6.24-2.6.24/debian/build/build-generic/media/gspcav1/gspca_core.c: init isoc: usb_submit_urb(0) ret -28
[148470.958359] /build/buildd/linux-ubuntu-modules-2.6.24-2.6.24/debian/build/build-generic/media/gspcav1/gspca_core.c: init isoc: usb_submit_urb(0) ret -28
[148492.551949] /build/buildd/linux-ubuntu-modules-2.6.24-2.6.24/debian/build/build-generic/media/gspcav1/gspca_core.c: init isoc: usb_submit_urb(0) ret -28
[148514.197438] /build/buildd/linux-ubuntu-modules-2.6.24-2.6.24/debian/build/build-generic/media/gspcav1/gspca_core.c: init isoc: usb_submit_urb(0) ret -28
[148535.878860] /build/buildd/linux-ubuntu-modules-2.6.24-2.6.24/debian/build/build-generic/media/gspcav1/gspca_core.c: init isoc: usb_submit_urb(0) ret -28
[148557.692024] /build/buildd/linux-ubuntu-modules-2.6.24-2.6.24/debian/build/build-generic/media/gspcav1/gspca_core.c: init isoc: usb_submit_urb(0) ret -28
[148579.269647] /build/buildd/linux-ubuntu-modules-2.6.24-2.6.24/debian/build/build-generic/media/gspcav1/gspca_core.c: init isoc: usb_submit_urb(0) ret -28
[148599.545763] /build/buildd/linux-ubuntu-modules-2.6.24-2.6.24/debian/build/build-generic/media/gspcav1/gspca_core.c: init isoc: usb_submit_urb(0) ret -28
[148740.071273] /build/buildd/linux-ubuntu-modules-2.6.24-2.6.24/debian/build/build-generic/media/gspcav1/gspca_core.c: init isoc: usb_submit_urb(0) ret -28
[148760.279516] /build/buildd/linux-ubuntu-modules-2.6.24-2.6.24/debian/build/build-generic/media/gspcav1/gspca_core.c: init isoc: usb_submit_urb(0) ret -28
[148780.510721] /build/buildd/linux-ubuntu-modules-2.6.24-2.6.24/debian/build/build-generic/media/gspcav1/gspca_core.c: init isoc: usb_submit_urb(0) ret -28
[148789.156141] /build/buildd/linux-ubuntu-modules-2.6.24-2.6.24/debian/build/build-generic/media/gspcav1/gspca_core.c: init isoc: usb_submit_urb(0) ret -28
[148797.860449] /build/buildd/linux-ubuntu-modules-2.6.24-2.6.24/debian/build/build-generic/media/gspcav1/gspca_core.c: init isoc: usb_submit_urb(0) ret -28
flo@zigzag:~$

y'a bien un truc avec gspca

#21 Re : -1 »  [Clos] Centralisation Probleme Webcam+EasyCam » Le 03/08/2008, à 19:37

richon
Réponses : 2370

ok derniere info en faite j'ai deux conte msn donc avec amsn j'ouvre mes deux compte et quand j'envoi ma cam d'un conte a un autre là sa marche nickel je voi ma cam

mais quand je l'envoi a un autre contact qui ne se trouve donc pas sur mon ordi j'ai le probleme indiqué au dessus

je ne pense pas que se soit un probleme de par feu ou de routeur vu que je reçoi les fichier et les cam des autres c la mienne que je n'arrive pas a emettre sauf a mon deusieme conte amsn

je vous remercie

#22 Re : -1 »  [Clos] Centralisation Probleme Webcam+EasyCam » Le 03/08/2008, à 20:13

richon
Réponses : 2370

ok je te remerci en tout cas

moi aussi je trouve cela bizare en faite tout mes contact on msn et non amsn mais bon tant pis je v essayer msn avec virtualbox vu qu'il on reglé le probleme de l'usb sa devrai marcher

si qq'un a une idée car j'aimerai ne plus avoir a faire avec windows

#23 Re : -1 »  [Clos] Centralisation Probleme Webcam+EasyCam » Le 04/08/2008, à 02:20

richon
Réponses : 2370

bon vu que j'ai des souci avec ma cam une question se pose, sachant qu'il y a surement une cam compatible a 100 % autour de 20 euro, et  sachant que 20 euro c'est environ 3 heure de taff au smic et il raisonable de passer encore une journée dessus et bien non tant pis je craque pour mon bien car les vacances c pas pour etre devant le pc

donc voila anbreizh je te demande a toi quelle est la cam la moins cher dont tu es presque sur que avec eazycam 2 et hardy il n'y aura pas de souci (ou celle que tu pense ou y'en a le moins)  et qui marche avec amsn

en tout cas merci a toi pour le boulot que tu fais je pense que nombreuse cam installé te sont reconnaissable

#24 -1 »  prbleme install xdtv 2.4.1cvs11 » Le 01/08/2008, à 17:31

richon
Réponses : 2

bonjour voila j'ai suivi les conceils de readme

j'ai la derniere version de ubuntu la 8

ds un premier temps j'ai decompressé le fichier ds mon repertoire puis je me suis placé dedans et j'ai cliqué

flo@zigzag:~/xdtv-2.4.1cvs11$ ./configure --prefix=/usr

reponse:

flo@zigzag:~/xdtv-2.4.1cvs11$ ./configure --prefix=/usr
checking for pkg-config... /usr/bin/pkg-config
checking pkg-config is at least version 0.9.0... yes
checking for a BSD-compatible install... /usr/bin/install -c
checking whether build environment is sane... yes
checking for gawk... no
checking for mawk... mawk
checking whether make sets $(MAKE)... yes
checking for gcc... gcc
checking for C compiler default output file name... a.out
checking whether the C compiler works... yes
checking whether we are cross compiling... no
checking for suffix of executables... 
checking for suffix of object files... o
checking whether we are using the GNU C compiler... yes
checking whether gcc accepts -g... yes
checking for gcc option to accept ISO C89... none needed
checking for style of include used by make... GNU
checking dependency style of gcc... gcc3
checking for a BSD-compatible install... /usr/bin/install -c
checking whether make sets $(MAKE)... (cached) yes
checking build system type... i686-pc-linux-gnu
checking host system type... i686-pc-linux-gnu
checking for a sed that does not truncate output... /bin/sed
checking for grep that handles long lines and -e... /bin/grep
checking for egrep... /bin/grep -E
checking for ld used by gcc... /usr/bin/ld
checking if the linker (/usr/bin/ld) is GNU ld... yes
checking for /usr/bin/ld option to reload object files... -r
checking for BSD-compatible nm... /usr/bin/nm -B
checking whether ln -s works... yes
checking how to recognize dependent libraries... pass_all
checking how to run the C preprocessor... gcc -E
checking for ANSI C header files... yes
checking for sys/types.h... yes
checking for sys/stat.h... yes
checking for stdlib.h... yes
checking for string.h... yes
checking for memory.h... yes
checking for strings.h... yes
checking for inttypes.h... yes
checking for stdint.h... yes
checking for unistd.h... yes
checking dlfcn.h usability... yes
checking dlfcn.h presence... yes
checking for dlfcn.h... yes
checking for g++... g++
checking whether we are using the GNU C++ compiler... yes
checking whether g++ accepts -g... yes
checking dependency style of g++... gcc3
checking how to run the C++ preprocessor... g++ -E
checking for g77... g77
checking whether we are using the GNU Fortran 77 compiler... yes
checking whether g77 accepts -g... yes
checking the maximum length of command line arguments... 98304
checking command to parse /usr/bin/nm -B output from gcc object... ok
checking for objdir... .libs
checking for ar... ar
checking for ranlib... ranlib
checking for strip... strip
checking if gcc supports -fno-rtti -fno-exceptions... no
checking for gcc option to produce PIC... -fPIC
checking if gcc PIC flag -fPIC works... yes
checking if gcc static flag -static works... yes
checking if gcc supports -c -o file.o... yes
checking whether the gcc linker (/usr/bin/ld) supports shared libraries... yes
checking whether -lc should be explicitly linked in... no
checking dynamic linker characteristics... GNU/Linux ld.so
checking how to hardcode library paths into programs... immediate
checking whether stripping libraries is possible... yes
checking if libtool supports shared libraries... yes
checking whether to build shared libraries... yes
checking whether to build static libraries... yes
configure: creating libtool
appending configuration tag "CXX" to libtool
checking for ld used by g++... /usr/bin/ld
checking if the linker (/usr/bin/ld) is GNU ld... yes
checking whether the g++ linker (/usr/bin/ld) supports shared libraries... yes
checking for g++ option to produce PIC... -fPIC
checking if g++ PIC flag -fPIC works... yes
checking if g++ static flag -static works... yes
checking if g++ supports -c -o file.o... yes
checking whether the g++ linker (/usr/bin/ld) supports shared libraries... yes
checking dynamic linker characteristics... GNU/Linux ld.so
checking how to hardcode library paths into programs... immediate
appending configuration tag "F77" to libtool
checking if libtool supports shared libraries... yes
checking whether to build shared libraries... yes
checking whether to build static libraries... yes
checking for g77 option to produce PIC... -fPIC
checking if g77 PIC flag -fPIC works... yes
checking if g77 static flag -static works... yes
checking if g77 supports -c -o file.o... yes
checking whether the g77 linker (/usr/bin/ld) supports shared libraries... yes
checking dynamic linker characteristics... GNU/Linux ld.so
checking how to hardcode library paths into programs... immediate
checking for ANSI C header files... (cached) yes
checking fcntl.h usability... yes
checking fcntl.h presence... yes
checking for fcntl.h... yes
checking for strings.h... (cached) yes
checking sys/ioctl.h usability... yes
checking sys/ioctl.h presence... yes
checking for sys/ioctl.h... yes
checking sys/time.h usability... yes
checking sys/time.h presence... yes
checking for sys/time.h... yes
checking for unistd.h... (cached) yes
checking locale.h usability... yes
checking locale.h presence... yes
checking for locale.h... yes
checking libintl.h usability... yes
checking libintl.h presence... yes
checking for libintl.h... yes
checking signal.h usability... yes
checking signal.h presence... yes
checking for signal.h... yes
checking for an ANSI C-conforming const... yes
checking for inline... inline
checking for off_t... yes
checking for size_t... yes
checking for struct stat.st_rdev... yes
checking whether time.h and sys/time.h may both be included... yes
checking whether gcc needs -traditional... no
checking whether sys/types.h defines makedev... yes
checking for stdlib.h... (cached) yes
checking for unistd.h... (cached) yes
checking for getpagesize... yes
checking for working mmap... yes
checking for getcwd... yes
checking for gettimeofday... yes
checking for mkdir... yes
checking for strdup... yes
checking for strerror... yes
checking for sigrelse... yes
checking for xterm... yes
checking whether byte ordering is bigendian... no
checking for gcc version... 4.2.3
*** CPU detection disabled, using default values ***
checking for host system... linux
checking for video4linux... yes
checking for video4linux version 2... yes
checking soundcard.h usability... no
checking soundcard.h presence... no
checking for soundcard.h... no
checking sys/soundcard.h usability... yes
checking sys/soundcard.h presence... yes
checking for sys/soundcard.h... yes
checking linux/soundcard.h usability... yes
checking linux/soundcard.h presence... yes
checking for linux/soundcard.h... yes
checking machine/soundcard.h usability... no
checking machine/soundcard.h presence... no
checking for machine/soundcard.h... no
checking for rint in -lm... yes
checking for socket... yes
checking for gethostbyname... yes
checking for herror... yes
checking for X... libraries , headers 
checking for gethostbyname... (cached) yes
checking for connect... yes
checking for remove... yes
checking for shmat... yes
checking for IceConnectionNumber in -lICE... yes
checking for XShmAttach in -lXext... yes
checking for XtDisplay in -lXt... yes
checking for XmuGetHostname in -lXmu... yes
checking for XawDialogAddButton in -lXaw... yes
checking for Xaw3dComputeTopShadowRGB in -lXaw3d... yes
checking for Xaw3dComputeTopShadowRGB in -lXaw95... no
checking for Xaw3dComputeTopShadowRGB in -lXawM... no
checking for Xaw3dComputeTopShadowRGB in -lneXtaw... no
*** Will link against: -lXaw3d ***
checking for bdftopcf... /usr/bin/bdftopcf
checking for mkfontscale... /usr/bin/mkfontscale
checking for mkfontdir... /usr/bin/mkfontdir
checking for xset... /usr/bin/xset
checking for the fonts directory... 
checking for the app-defaults directory... /etc/X11/app-defaults
checking for the wizard conf directory... /etc/xdtv
checking for XpmCreatePixmapFromData in -lXpm... yes
checking for MwTextFieldGetString in -lMowitz... no
checking for jpeg_start_compress in -ljpeg... no
checking for pthread_create in -lpthread... yes
checking for sem_init... no
checking for sem_init in -lpthread... yes
checking for lirc header files... no
checking for snd_pcm_readi in -lasound... no
*** ALSA doesn't seem to be installed. You might come across troubles if your native OSS drivers are not full duplex. In that case any complaints will go to /dev/null ***
checking for XF86DGAQueryExtension in -lXxf86dga... yes
checking for XF86VidModeQueryExtension in -lXxf86vm... yes
checking for DPMSQueryExtension in -lXdpms... no
checking for DPMSQueryExtension in -lXext... yes
checking for XineramaQueryExtension in -lXinerama... yes
checking for gettext... yes
checking for XvQueryExtension in -lXv... yes
checking for devfs... no
checking for dlopen in -ldl... yes
checking for ffmpeg inside distribution... yes
checking for XviD header files... no
*** Could not find XviD header files ***
checking if XviD API version is 2.1 or 4.0 or 4.1... no
*** XviD API version is not 2.1 or 4.0: feature is disabled ***
checking for ogg-vorbis-theora header files... no
*** Could not find ogg-vorbis-theora header files ***
checking for ogg_stream_init  in -logg... no
*** Could not find ogg librarie ***
checking for vorbis_info_init  in -lvorbis... no
*** Could not find vorbis librarie ***
checking for vorbis_encode_init  in -lvorbisenc... no
*** Could not find vorbisenc librarie ***
checking for theora_encode_init in -ltheora... no
*** Could not find theora librarie ***
*** Could not find ogg-vorbis-theora libraries: feature is disabled ***
checking for divx4linux header files... no
*** Could not find divx4linux header files ***
checking for encore in -ldivxencore... no
*** Could not find divx4linux libraries: feature is disabled ***
checking for lame header files... no
*** Could not find lame header files ***
checking for png_read_image in -lpng... no
*** zvbi support disabled ***
checking for faac header files... no
checking for x264 header files... no
checking for DVB driver support... yes
checking for libsdl header files... no
*** DVB support disabled ***
checking for libcurl header files... no
*** DVB support disabled ***
checking for DBUS... no
*** DBUS for gnomescreensaver management disable ***
*** AleVT vtxt font used ***
checking for lrintf... yes
checking for llrint... yes
checking for lrint... yes
checking for round... yes
checking for roundf... yes
checking for mkstemp... yes
checking for memalign... yes
checking for socklen_t... yes
configure: creating ./config.status
config.status: creating config.mak
config.status: creating Makefile
config.status: creating alevt/Makefile
config.status: creating src/Makefile
config.status: creating font/Makefile
config.status: creating xdtv.spec
config.status: creating xdtv-mandriva.spec
config.status: creating xdtv-fedora.spec
config.status: creating xdtv-suse.spec
config.status: creating xdtv_scan.sh
config.status: creating xdtv_record.sh
config.status: creating debian/xdtv.files
config.status: creating slackware/build.conf
config.status: creating XdTV.ad
config.status: creating man/Makefile
config.status: creating src/dvb/Makefile
config.status: creating config.h
config.status: config.h is unchanged
config.status: executing depfiles commands
flo@zigzag:~/xdtv-2.4.1cvs11$

apres je tape la commande make

reponse

flo@zigzag:~/xdtv-2.4.1cvs11$ make
make  all-recursive
make[1]: entrant dans le répertoire « /home/flo/xdtv-2.4.1cvs11 »
Making all in libavutil
make[2]: entrant dans le répertoire « /home/flo/xdtv-2.4.1cvs11/libavutil »
make[2]: Rien à faire pour « all ».
make[2]: quittant le répertoire « /home/flo/xdtv-2.4.1cvs11/libavutil »
Making all in libavcodec
make[2]: entrant dans le répertoire « /home/flo/xdtv-2.4.1cvs11/libavcodec »
make[2]: Rien à faire pour « all ».
make[2]: quittant le répertoire « /home/flo/xdtv-2.4.1cvs11/libavcodec »
Making all in libavformat
make[2]: entrant dans le répertoire « /home/flo/xdtv-2.4.1cvs11/libavformat »
make[2]: Rien à faire pour « all ».
make[2]: quittant le répertoire « /home/flo/xdtv-2.4.1cvs11/libavformat »
Making all in libpostproc
make[2]: entrant dans le répertoire « /home/flo/xdtv-2.4.1cvs11/libpostproc »
make[2]: Rien à faire pour « all ».
make[2]: quittant le répertoire « /home/flo/xdtv-2.4.1cvs11/libpostproc »
Making all in libswscale
make[2]: entrant dans le répertoire « /home/flo/xdtv-2.4.1cvs11/libswscale »
make[2]: Rien à faire pour « all ».
make[2]: quittant le répertoire « /home/flo/xdtv-2.4.1cvs11/libswscale »
Making all in alevt
make[2]: entrant dans le répertoire « /home/flo/xdtv-2.4.1cvs11/alevt »
make  all-am
make[3]: entrant dans le répertoire « /home/flo/xdtv-2.4.1cvs11/alevt »
make[3]: Rien à faire pour « all-am ».
make[3]: quittant le répertoire « /home/flo/xdtv-2.4.1cvs11/alevt »
make[2]: quittant le répertoire « /home/flo/xdtv-2.4.1cvs11/alevt »
Making all in src
make[2]: entrant dans le répertoire « /home/flo/xdtv-2.4.1cvs11/src »
make[3]: entrant dans le répertoire « /home/flo/xdtv-2.4.1cvs11/src »
make[3]: Rien à faire pour « all-am ».
make[3]: quittant le répertoire « /home/flo/xdtv-2.4.1cvs11/src »
make[2]: quittant le répertoire « /home/flo/xdtv-2.4.1cvs11/src »
Making all in font
make[2]: entrant dans le répertoire « /home/flo/xdtv-2.4.1cvs11/font »
make[2]: Rien à faire pour « all ».
make[2]: quittant le répertoire « /home/flo/xdtv-2.4.1cvs11/font »
Making all in man
make[2]: entrant dans le répertoire « /home/flo/xdtv-2.4.1cvs11/man »
make[2]: Rien à faire pour « all ».
make[2]: quittant le répertoire « /home/flo/xdtv-2.4.1cvs11/man »
make[2]: entrant dans le répertoire « /home/flo/xdtv-2.4.1cvs11 »
make[2]: quittant le répertoire « /home/flo/xdtv-2.4.1cvs11 »
make[1]: quittant le répertoire « /home/flo/xdtv-2.4.1cvs11 »
flo@zigzag:~/xdtv-2.4.1cvs11$

apres

flo@zigzag:~/xdtv-2.4.1cvs11$ make install
Making install in libavutil
make[1]: entrant dans le répertoire « /home/flo/xdtv-2.4.1cvs11/libavutil »
make[1]: Rien à faire pour « install ».
make[1]: quittant le répertoire « /home/flo/xdtv-2.4.1cvs11/libavutil »
Making install in libavcodec
make[1]: entrant dans le répertoire « /home/flo/xdtv-2.4.1cvs11/libavcodec »
make[1]: Rien à faire pour « install ».
make[1]: quittant le répertoire « /home/flo/xdtv-2.4.1cvs11/libavcodec »
Making install in libavformat
make[1]: entrant dans le répertoire « /home/flo/xdtv-2.4.1cvs11/libavformat »
make[1]: Rien à faire pour « install ».
make[1]: quittant le répertoire « /home/flo/xdtv-2.4.1cvs11/libavformat »
Making install in libpostproc
make[1]: entrant dans le répertoire « /home/flo/xdtv-2.4.1cvs11/libpostproc »
make[1]: Rien à faire pour « install ».
make[1]: quittant le répertoire « /home/flo/xdtv-2.4.1cvs11/libpostproc »
Making install in libswscale
make[1]: entrant dans le répertoire « /home/flo/xdtv-2.4.1cvs11/libswscale »
make[1]: Rien à faire pour « install ».
make[1]: quittant le répertoire « /home/flo/xdtv-2.4.1cvs11/libswscale »
Making install in alevt
make[1]: entrant dans le répertoire « /home/flo/xdtv-2.4.1cvs11/alevt »
make  install-am
make[2]: entrant dans le répertoire « /home/flo/xdtv-2.4.1cvs11/alevt »
make[3]: entrant dans le répertoire « /home/flo/xdtv-2.4.1cvs11/alevt »
/bin/bash ../mkinstalldirs /usr/bin
  /bin/bash ../libtool --mode=install /usr/bin/install -c xdtv_alevt-cap /usr/bin/xdtv_alevt-cap
/usr/bin/install -c xdtv_alevt-cap /usr/bin/xdtv_alevt-cap
/usr/bin/install: cannot create regular file `/usr/bin/xdtv_alevt-cap': Permission denied
make[3]: *** [install-binPROGRAMS] Erreur 1
make[3]: quittant le répertoire « /home/flo/xdtv-2.4.1cvs11/alevt »
make[2]: *** [install-am] Erreur 2
make[2]: quittant le répertoire « /home/flo/xdtv-2.4.1cvs11/alevt »
make[1]: *** [install] Erreur 2
make[1]: quittant le répertoire « /home/flo/xdtv-2.4.1cvs11/alevt »
make: *** [install-recursive] Erreur 1
flo@zigzag:~/xdtv-2.4.1cvs11$

quand je tape dans le terminal xdtv, il me repond commande not found


voila si qq'un peut m'aider moi je vous cache pas que je suis tt nouvo sur ubuntu et qd on sort un petit peu de l'ordinaire je suis un peut paumer mais je tiens a mettre ce programme merci a tous