Contenu | Rechercher | Menus

Annonce

Si vous rencontrez des soucis à rester connecté sur le forum (ou si vous avez perdu votre mot de passe) déconnectez-vous et reconnectez-vous depuis cette page, en cochant la case "Me connecter automatiquement lors de mes prochaines visites".
nombre réponses : 25

#0 Re : -1 »  [Résolu] ubuntu 15.04 » Le 27/04/2015, à 20:34

xanmoo
Réponses : 12

La mise à niveau de 14.10 à 15.04 s'est bien passée. des petits problèmes de gel de l'écran avec le pilote nvidia se sont résolu automagiquement. Quelques améliorations de unity vues sur omg ubuntu (tiroir dans le dash) rendent l'usage agréable. Par contre je trouve que le multi-moniteur reste folklorique ...

#1 Re : -1 »  Avenir de Lubuntu » Le 30/04/2014, à 15:02

xanmoo
Réponses : 89

Aucun avenir chez moi, si Lubuntu ne tourne pas sur mon ordinosaure (hp nx6110, cpu non pae)

#2 Re : -1 »  Avenir de Lubuntu » Le 02/05/2014, à 14:59

xanmoo
Réponses : 89

Pour l'instant la 14.04 tourne bien sur ma bécane HP nx6110 avec DD 40Go, 1Go RAM, intel céléron M 1 GHz, avec un noyau issu de Lubuntu 13.10 (fake-pae sans doute). Est-ce que les mises à jour à venir se passeront bien... tant que je gagne, je joue.
Je n'ai pas compris comment installer le noyau non-pae de la 14.04 pour passer l'option forcepae si dès le départ l'installation du noyau échoue ...

#3 -1 »  executer un fichier jnlp (Site PHET) » Le 15/02/2015, à 20:22

xanmoo
Réponses : 2

Bonjour,
Je suis sous 14.10 avec la version icetea  (Version 7 Update 75 selon Oracle). J'essaie d'écuter un programme du site PHETPHET simulation en physique et donc cela ne fonctionne puls (comme dans le temps). L'extension n'est associée à rien, impossible de lancer la simulation.

#4 Re : -1 »  executer un fichier jnlp (Site PHET) » Le 16/02/2015, à 18:45

xanmoo
Réponses : 2

Iced Tea Java WebStart ne fait pas parti des choix ...

openjdk 6 et 7 sont installés, après avoir installé la version openjdk 8, il est possible de lancer le fichier jar. Pour les fichier jnlp, seul firefox est proposé et cela ne fonctionne pas... à suivre.

#5 -1 »  league of legend: la connection au serveur échoue depuis hier » Le 17/10/2014, à 18:44

xanmoo
Réponses : 3

Bonjour,

Depuis hier, impossible de se connecter au serveur europe de l'ouest.

LOL (League of Legends 4.18.14_10_07_13_39) tournait bien auparavant. Avez vous le même problème? Comment résoudre le problème? (à part tout réinstaller, créer un autre compte ...)


merci

#8 Re : -1 »  League of legends - erreur de connexion » Le 17/10/2014, à 19:19

xanmoo
Réponses : 14

La mise à jour vers POL 4.2.5 ne suffit pas

#9 Re : -1 »  League of legends - erreur de connexion » Le 17/10/2014, à 19:42

xanmoo
Réponses : 14

C'est réparé, depuis l'interface de POL > configurer > éditeur de la base de registres>

Puis je n'ai pas effacé la clée wininet, simplement renommée en OLDwininet

#10 -1 »  Compiler opencv3 alpha avec support cuda: opencl_kernels_core.hpp ? » Le 07/11/2014, à 12:08

xanmoo
Réponses : 6

Bonjour,
J'essaie de compiler opencv3 avec le support cuda et python en utilisant cmake-gui sur un i5+nvidia 740m
J'ai installer cuda 5.5 depuis les dépots et un tas de lib depuis synaptics.

La sortie de l'étape de configuration est:

The CXX compiler identification is GNU 4.8.2
The C compiler identification is GNU 4.8.2
Check for working CXX compiler: /usr/bin/c++
Check for working CXX compiler: /usr/bin/c++ -- works
Detecting CXX compiler ABI info
Detecting CXX compiler ABI info - done
Check for working C compiler: /usr/bin/cc
Check for working C compiler: /usr/bin/cc -- works
Detecting C compiler ABI info
Detecting C compiler ABI info - done
Detected version of GNU GCC: 48 (408)
Performing Test HAVE_CXX_FSIGNED_CHAR
Performing Test HAVE_CXX_FSIGNED_CHAR - Success
Performing Test HAVE_C_FSIGNED_CHAR
Performing Test HAVE_C_FSIGNED_CHAR - Success
Performing Test HAVE_CXX_W
Performing Test HAVE_CXX_W - Success
Performing Test HAVE_C_W
Performing Test HAVE_C_W - Success
Performing Test HAVE_CXX_WALL
Performing Test HAVE_CXX_WALL - Success
Performing Test HAVE_C_WALL
Performing Test HAVE_C_WALL - Success
Performing Test HAVE_CXX_WERROR_RETURN_TYPE
Performing Test HAVE_CXX_WERROR_RETURN_TYPE - Success
Performing Test HAVE_C_WERROR_RETURN_TYPE
Performing Test HAVE_C_WERROR_RETURN_TYPE - Success
Performing Test HAVE_CXX_WERROR_NON_VIRTUAL_DTOR
Performing Test HAVE_CXX_WERROR_NON_VIRTUAL_DTOR - Success
Performing Test HAVE_C_WERROR_NON_VIRTUAL_DTOR
Performing Test HAVE_C_WERROR_NON_VIRTUAL_DTOR - Success
Performing Test HAVE_CXX_WERROR_ADDRESS
Performing Test HAVE_CXX_WERROR_ADDRESS - Success
Performing Test HAVE_C_WERROR_ADDRESS
Performing Test HAVE_C_WERROR_ADDRESS - Success
Performing Test HAVE_CXX_WERROR_SEQUENCE_POINT
Performing Test HAVE_CXX_WERROR_SEQUENCE_POINT - Success
Performing Test HAVE_C_WERROR_SEQUENCE_POINT
Performing Test HAVE_C_WERROR_SEQUENCE_POINT - Success
Performing Test HAVE_CXX_WFORMAT
Performing Test HAVE_CXX_WFORMAT - Success
Performing Test HAVE_C_WFORMAT
Performing Test HAVE_C_WFORMAT - Success
Performing Test HAVE_CXX_WERROR_FORMAT_SECURITY
Performing Test HAVE_CXX_WERROR_FORMAT_SECURITY - Success
Performing Test HAVE_C_WERROR_FORMAT_SECURITY
Performing Test HAVE_C_WERROR_FORMAT_SECURITY - Success
Performing Test HAVE_CXX_WMISSING_DECLARATIONS
Performing Test HAVE_CXX_WMISSING_DECLARATIONS - Success
Performing Test HAVE_C_WMISSING_DECLARATIONS
Performing Test HAVE_C_WMISSING_DECLARATIONS - Success
Performing Test HAVE_CXX_WMISSING_PROTOTYPES
Performing Test HAVE_CXX_WMISSING_PROTOTYPES - Failed
Performing Test HAVE_C_WMISSING_PROTOTYPES
Performing Test HAVE_C_WMISSING_PROTOTYPES - Success
Performing Test HAVE_CXX_WSTRICT_PROTOTYPES
Performing Test HAVE_CXX_WSTRICT_PROTOTYPES - Failed
Performing Test HAVE_C_WSTRICT_PROTOTYPES
Performing Test HAVE_C_WSTRICT_PROTOTYPES - Success
Performing Test HAVE_CXX_WUNDEF
Performing Test HAVE_CXX_WUNDEF - Success
Performing Test HAVE_C_WUNDEF
Performing Test HAVE_C_WUNDEF - Success
Performing Test HAVE_CXX_WINIT_SELF
Performing Test HAVE_CXX_WINIT_SELF - Success
Performing Test HAVE_C_WINIT_SELF
Performing Test HAVE_C_WINIT_SELF - Success
Performing Test HAVE_CXX_WPOINTER_ARITH
Performing Test HAVE_CXX_WPOINTER_ARITH - Success
Performing Test HAVE_C_WPOINTER_ARITH
Performing Test HAVE_C_WPOINTER_ARITH - Success
Performing Test HAVE_CXX_WSHADOW
Performing Test HAVE_CXX_WSHADOW - Success
Performing Test HAVE_C_WSHADOW
Performing Test HAVE_C_WSHADOW - Success
Performing Test HAVE_CXX_WSIGN_PROMO
Performing Test HAVE_CXX_WSIGN_PROMO - Success
Performing Test HAVE_C_WSIGN_PROMO
Performing Test HAVE_C_WSIGN_PROMO - Failed
Performing Test HAVE_CXX_WNO_NARROWING
Performing Test HAVE_CXX_WNO_NARROWING - Success
Performing Test HAVE_C_WNO_NARROWING
Performing Test HAVE_C_WNO_NARROWING - Success
Performing Test HAVE_CXX_WNO_DELETE_NON_VIRTUAL_DTOR
Performing Test HAVE_CXX_WNO_DELETE_NON_VIRTUAL_DTOR - Success
Performing Test HAVE_C_WNO_DELETE_NON_VIRTUAL_DTOR
Performing Test HAVE_C_WNO_DELETE_NON_VIRTUAL_DTOR - Failed
Performing Test HAVE_CXX_WNO_UNNAMED_TYPE_TEMPLATE_ARGS
Performing Test HAVE_CXX_WNO_UNNAMED_TYPE_TEMPLATE_ARGS - Failed
Performing Test HAVE_C_WNO_UNNAMED_TYPE_TEMPLATE_ARGS
Performing Test HAVE_C_WNO_UNNAMED_TYPE_TEMPLATE_ARGS - Failed
Performing Test HAVE_CXX_FDIAGNOSTICS_SHOW_OPTION
Performing Test HAVE_CXX_FDIAGNOSTICS_SHOW_OPTION - Success
Performing Test HAVE_C_FDIAGNOSTICS_SHOW_OPTION
Performing Test HAVE_C_FDIAGNOSTICS_SHOW_OPTION - Success
Performing Test HAVE_CXX_WNO_LONG_LONG
Performing Test HAVE_CXX_WNO_LONG_LONG - Success
Performing Test HAVE_C_WNO_LONG_LONG
Performing Test HAVE_C_WNO_LONG_LONG - Success
Performing Test HAVE_CXX_PTHREAD
Performing Test HAVE_CXX_PTHREAD - Success
Performing Test HAVE_C_PTHREAD
Performing Test HAVE_C_PTHREAD - Success
Performing Test HAVE_CXX_FOMIT_FRAME_POINTER
Performing Test HAVE_CXX_FOMIT_FRAME_POINTER - Success
Performing Test HAVE_C_FOMIT_FRAME_POINTER
Performing Test HAVE_C_FOMIT_FRAME_POINTER - Success
Performing Test HAVE_CXX_MSSE
Performing Test HAVE_CXX_MSSE - Success
Performing Test HAVE_C_MSSE
Performing Test HAVE_C_MSSE - Success
Performing Test HAVE_CXX_MSSE2
Performing Test HAVE_CXX_MSSE2 - Success
Performing Test HAVE_C_MSSE2
Performing Test HAVE_C_MSSE2 - Success
Performing Test HAVE_CXX_MSSE3
Performing Test HAVE_CXX_MSSE3 - Success
Performing Test HAVE_C_MSSE3
Performing Test HAVE_C_MSSE3 - Success
Performing Test HAVE_CXX_FFUNCTION_SECTIONS
Performing Test HAVE_CXX_FFUNCTION_SECTIONS - Success
Performing Test HAVE_C_FFUNCTION_SECTIONS
Performing Test HAVE_C_FFUNCTION_SECTIONS - Success
Performing Test HAVE_CXX_FVISIBILITY_HIDDEN
Performing Test HAVE_CXX_FVISIBILITY_HIDDEN - Success
Performing Test HAVE_C_FVISIBILITY_HIDDEN
Performing Test HAVE_C_FVISIBILITY_HIDDEN - Success
Performing Test HAVE_CXX_FVISIBILITY_INLINES_HIDDEN
Performing Test HAVE_CXX_FVISIBILITY_INLINES_HIDDEN - Success
Performing Test HAVE_C_FVISIBILITY_INLINES_HIDDEN
Performing Test HAVE_C_FVISIBILITY_INLINES_HIDDEN - Failed
Looking for pthread.h
Looking for pthread.h - found
Check if the system is big endian
Searching 16 bit integer
Looking for sys/types.h
Looking for sys/types.h - found
Looking for stdint.h
Looking for stdint.h - found
Looking for stddef.h
Looking for stddef.h - found
Check size of unsigned short
Check size of unsigned short - done
Using unsigned short
Check if the system is big endian - little endian
Found ZLIB: /usr/lib/x86_64-linux-gnu/libz.so (found suitable version "1.2.8", minimum required is "1.2.3") 
Found TIFF: /usr/lib/x86_64-linux-gnu/libtiff.so (found version "4.0.3") 
Found JPEG: /usr/lib/x86_64-linux-gnu/libjpeg.so  
Performing Test HAVE_C_WNO_UNUSED_VARIABLE
Performing Test HAVE_C_WNO_UNUSED_VARIABLE - Success
Performing Test HAVE_C_WNO_SHADOW
Performing Test HAVE_C_WNO_SHADOW - Success
Performing Test HAVE_C_WNO_MAYBE_UNINITIALIZED
Performing Test HAVE_C_WNO_MAYBE_UNINITIALIZED - Success
Could NOT find Jasper (missing:  JASPER_LIBRARIES JASPER_INCLUDE_DIR) 
Performing Test HAVE_C_WNO_IMPLICIT_FUNCTION_DECLARATION
Performing Test HAVE_C_WNO_IMPLICIT_FUNCTION_DECLARATION - Success
Performing Test HAVE_C_WNO_UNINITIALIZED
Performing Test HAVE_C_WNO_UNINITIALIZED - Success
Performing Test HAVE_C_WNO_MISSING_PROTOTYPES
Performing Test HAVE_C_WNO_MISSING_PROTOTYPES - Success
Performing Test HAVE_C_WNO_UNUSED_BUT_SET_PARAMETER
Performing Test HAVE_C_WNO_UNUSED_BUT_SET_PARAMETER - Success
Performing Test HAVE_C_WNO_MISSING_DECLARATIONS
Performing Test HAVE_C_WNO_MISSING_DECLARATIONS - Success
Performing Test HAVE_C_WNO_UNUSED
Performing Test HAVE_C_WNO_UNUSED - Success
Performing Test HAVE_C_WNO_SIGN_COMPARE
Performing Test HAVE_C_WNO_SIGN_COMPARE - Success
Performing Test HAVE_C_WNO_STRICT_OVERFLOW
Performing Test HAVE_C_WNO_STRICT_OVERFLOW - Success
Performing Test HAVE_C_WNO_UNUSED_PARAMETER
Performing Test HAVE_C_WNO_UNUSED_PARAMETER - Success
Found ZLIB: /usr/lib/x86_64-linux-gnu/libz.so (found version "1.2.8") 
Found PNG: /usr/lib/x86_64-linux-gnu/libpng.so (found version "1.2.50") 
Looking for /usr/include/libpng/png.h
Looking for /usr/include/libpng/png.h - found
Looking for semaphore.h
Looking for semaphore.h - found
Performing Test HAVE_CXX_WNO_SHADOW
Performing Test HAVE_CXX_WNO_SHADOW - Success
Performing Test HAVE_CXX_WNO_UNUSED
Performing Test HAVE_CXX_WNO_UNUSED - Success
Performing Test HAVE_CXX_WNO_SIGN_COMPARE
Performing Test HAVE_CXX_WNO_SIGN_COMPARE - Success
Performing Test HAVE_CXX_WNO_UNDEF
Performing Test HAVE_CXX_WNO_UNDEF - Success
Performing Test HAVE_CXX_WNO_MISSING_DECLARATIONS
Performing Test HAVE_CXX_WNO_MISSING_DECLARATIONS - Success
Performing Test HAVE_CXX_WNO_UNINITIALIZED
Performing Test HAVE_CXX_WNO_UNINITIALIZED - Success
Performing Test HAVE_CXX_WNO_SWITCH
Performing Test HAVE_CXX_WNO_SWITCH - Success
Performing Test HAVE_CXX_WNO_PARENTHESES
Performing Test HAVE_CXX_WNO_PARENTHESES - Success
Performing Test HAVE_CXX_WNO_ARRAY_BOUNDS
Performing Test HAVE_CXX_WNO_ARRAY_BOUNDS - Success
Performing Test HAVE_CXX_WNO_EXTRA
Performing Test HAVE_CXX_WNO_EXTRA - Success
checking for module 'gtk+-3.0'
  found gtk+-3.0, version 3.10.8
checking for module 'gthread-2.0'
  found gthread-2.0, version 2.40.2
checking for module 'gstreamer-base-1.0'
  found gstreamer-base-1.0, version 1.2.4
checking for module 'gstreamer-video-1.0'
  found gstreamer-video-1.0, version 1.2.4
checking for module 'gstreamer-app-1.0'
  found gstreamer-app-1.0, version 1.2.4
checking for module 'gstreamer-riff-1.0'
  found gstreamer-riff-1.0, version 1.2.4
checking for module 'gstreamer-pbutils-1.0'
  found gstreamer-pbutils-1.0, version 1.2.4
checking for module 'libdc1394-2'
  package 'libdc1394-2' not found
checking for module 'libdc1394'
  package 'libdc1394' not found
checking for module 'libv4l1'
  package 'libv4l1' not found
Looking for linux/videodev.h
Looking for linux/videodev.h - not found
Looking for linux/videodev2.h
Looking for linux/videodev2.h - found
Looking for sys/videoio.h
Looking for sys/videoio.h - not found
checking for module 'libavcodec'
  found libavcodec, version 54.35.0
checking for module 'libavformat'
  found libavformat, version 54.20.4
checking for module 'libavutil'
  found libavutil, version 52.3.0
checking for module 'libswscale'
  found libswscale, version 2.1.1
Looking for libavformat/avformat.h
Looking for libavformat/avformat.h - found
Looking for ffmpeg/avformat.h
Looking for ffmpeg/avformat.h - not found
ICV: Removing previous unpacked package: /home/jeanpat/App/opencv-3.0.0-alpha/3rdparty/ippicv/unpack
ICV: Unpacking ippicv_linux_20140513.tgz to /home/jeanpat/App/opencv-3.0.0-alpha/3rdparty/ippicv/unpack...
ICV: Package successfully downloaded
found IPP (ICV version): 8.1.1 [8.1.1]
at: /home/jeanpat/App/opencv-3.0.0-alpha/3rdparty/ippicv/unpack/ippicv_lnx
CUDA detected: 5.5
CUDA NVCC target flags: -gencode;arch=compute_11,code=sm_11;-gencode;arch=compute_12,code=sm_12;-gencode;arch=compute_13,code=sm_13;-gencode;arch=compute_20,code=sm_20;-gencode;arch=compute_20,code=sm_21;-gencode;arch=compute_30,code=sm_30;-gencode;arch=compute_35,code=sm_35;-gencode;arch=compute_30,code=compute_30
Found PythonInterp: /usr/bin/python2.7 (found suitable version "2.7.6", minimum required is "2.7") 
Found PythonLibs: /usr/lib/x86_64-linux-gnu/libpython2.7.so (found suitable exact version "2.7.6") 
Found PythonInterp: /usr/bin/python3.4 (found suitable version "3.4", minimum required is "3.4") 
Found PythonLibs: /usr/lib/x86_64-linux-gnu/libpython3.4m.so (found suitable exact version "3.4.0") 
Found Sphinx 1.2.2: /usr/bin/sphinx-build
Could NOT find JNI (missing:  JAVA_INCLUDE_PATH JAVA_INCLUDE_PATH2 JAVA_AWT_INCLUDE_PATH) 
Could NOT find Matlab (missing:  MATLAB_MEX_SCRIPT MATLAB_INCLUDE_DIRS MATLAB_ROOT_DIR MATLAB_LIBRARIES MATLAB_LIBRARY_DIRS MATLAB_MEXEXT MATLAB_ARCH MATLAB_BIN) 
VTK is not found. Please set -DVTK_DIR in CMake to VTK build directory, or to VTK install subdirectory with VTKConfig.cmake file
Performing Test HAVE_CXX_WNO_UNUSED_PARAMETER
Performing Test HAVE_CXX_WNO_UNUSED_PARAMETER - Success
Performing Test HAVE_CXX_WNO_UNUSED_FUNCTION
Performing Test HAVE_CXX_WNO_UNUSED_FUNCTION - Success
Performing Test HAVE_CXX_WNO_UNUSED_VARIABLE
Performing Test HAVE_CXX_WNO_UNUSED_VARIABLE - Success
Performing Test HAVE_CXX_WNO_ENUM_COMPARE
Performing Test HAVE_CXX_WNO_ENUM_COMPARE - Success
Performing Test HAVE_CXX_WNO_UNUSED_BUT_SET_VARIABLE
Performing Test HAVE_CXX_WNO_UNUSED_BUT_SET_VARIABLE - Success
Performing Test HAVE_CXX_WNO_DEPRECATED_DECLARATIONS
Performing Test HAVE_CXX_WNO_DEPRECATED_DECLARATIONS - Success

General configuration for OpenCV 3.0.0-alpha =====================================
  Version control:               unknown

  Platform:
    Host:                        Linux 3.13.0-36-generic x86_64
    CMake:                       2.8.12.2
    CMake generator:             Unix Makefiles
    CMake build tool:            /usr/bin/make
    Configuration:               Release

  C/C++:
    Built as dynamic libs?:      YES
    C++ Compiler:                /usr/bin/c++  (ver 4.8.2)
    C++ flags (Release):         -fsigned-char -W -Wall -Werror=return-type -Werror=non-virtual-dtor -Werror=address -Werror=sequence-point -Wformat -Werror=format-security -Wmissing-declarations -Wundef -Winit-self -Wpointer-arith -Wshadow -Wsign-promo -Wno-narrowing -Wno-delete-non-virtual-dtor -fdiagnostics-show-option -Wno-long-long -pthread -fomit-frame-pointer -msse -msse2 -msse3 -ffunction-sections -fvisibility=hidden -fvisibility-inlines-hidden -O3 -DNDEBUG  -DNDEBUG
    C++ flags (Debug):           -fsigned-char -W -Wall -Werror=return-type -Werror=non-virtual-dtor -Werror=address -Werror=sequence-point -Wformat -Werror=format-security -Wmissing-declarations -Wundef -Winit-self -Wpointer-arith -Wshadow -Wsign-promo -Wno-narrowing -Wno-delete-non-virtual-dtor -fdiagnostics-show-option -Wno-long-long -pthread -fomit-frame-pointer -msse -msse2 -msse3 -ffunction-sections -fvisibility=hidden -fvisibility-inlines-hidden -g  -O0 -DDEBUG -D_DEBUG
    C Compiler:                  /usr/bin/cc
    C flags (Release):           -fsigned-char -W -Wall -Werror=return-type -Werror=non-virtual-dtor -Werror=address -Werror=sequence-point -Wformat -Werror=format-security -Wmissing-declarations -Wmissing-prototypes -Wstrict-prototypes -Wundef -Winit-self -Wpointer-arith -Wshadow -Wno-narrowing -fdiagnostics-show-option -Wno-long-long -pthread -fomit-frame-pointer -msse -msse2 -msse3 -ffunction-sections -fvisibility=hidden -O3 -DNDEBUG  -DNDEBUG
    C flags (Debug):             -fsigned-char -W -Wall -Werror=return-type -Werror=non-virtual-dtor -Werror=address -Werror=sequence-point -Wformat -Werror=format-security -Wmissing-declarations -Wmissing-prototypes -Wstrict-prototypes -Wundef -Winit-self -Wpointer-arith -Wshadow -Wno-narrowing -fdiagnostics-show-option -Wno-long-long -pthread -fomit-frame-pointer -msse -msse2 -msse3 -ffunction-sections -fvisibility=hidden -g  -O0 -DDEBUG -D_DEBUG
    Linker flags (Release):      
    Linker flags (Debug):        
    Precompiled headers:         YES

  OpenCV modules:
    To be built:                 cudev core flann imgproc imgcodecs videoio highgui features2d calib3d cudaarithm ml objdetect cudalegacy cudawarping cuda cudafilters cudaimgproc video cudabgsegm cudacodec cudafeatures2d cudaoptflow cudastereo photo shape stitching superres videostab python2 python3 ts
    Disabled:                    world
    Disabled by dependency:      -
    Unavailable:                 androidcamera java viz

  GUI: 
    QT:                          NO
    GTK+ 3.x:                    YES (ver 3.10.8)
    GThread :                    YES (ver 2.40.2)
    GtkGlExt:                    NO
    OpenGL support:              NO
    VTK support:                 NO

  Media I/O: 
    ZLib:                        /usr/lib/x86_64-linux-gnu/libz.so (ver 1.2.8)
    JPEG:                        /usr/lib/x86_64-linux-gnu/libjpeg.so (ver )
    WEBP:                        build (ver 0.3.1)
    PNG:                         /usr/lib/x86_64-linux-gnu/libpng.so (ver 1.2.50)
    TIFF:                        /usr/lib/x86_64-linux-gnu/libtiff.so (ver 42 - 4.0.3)
    JPEG 2000:                   build (ver 1.900.1)
    OpenEXR:                     build (ver 1.7.1)
    GDAL:                        NO

  Video I/O:
    DC1394 1.x:                  NO
    DC1394 2.x:                  NO
    FFMPEG:                      YES
      codec:                     YES (ver 54.35.0)
      format:                    YES (ver 54.20.4)
      util:                      YES (ver 52.3.0)
      swscale:                   YES (ver 2.1.1)
      gentoo-style:              YES
    GStreamer:                   
      base:                      YES (ver 1.2.4)
      video:                     YES (ver 1.2.4)
      app:                       YES (ver 1.2.4)
      riff:                      YES (ver 1.2.4)
      pbutils:                   YES (ver 1.2.4)
    OpenNI:                      NO
    OpenNI PrimeSensor Modules:  NO
    OpenNI2:                     NO
    PvAPI:                       NO
    GigEVisionSDK:               NO
    UniCap:                      NO
    UniCap ucil:                 NO
    V4L/V4L2:                    NO/YES
    XIMEA:                       NO
    Xine:                        NO

  Other third-party libraries:
    Use IPP:                     8.1.1 [8.1.1]
         at:                     /home/jeanpat/App/opencv-3.0.0-alpha/3rdparty/ippicv/unpack/ippicv_lnx
    Use IPP Async:               NO
    Use Eigen:                   NO
    Use TBB:                     NO
    Use OpenMP:                  NO
    Use GCD                      NO
    Use Concurrency              NO
    Use C=:                      NO
    Use Cuda:                    YES (ver 5.5)
    Use OpenCL:                  YES

  NVIDIA CUDA
    Use CUFFT:                   YES
    Use CUBLAS:                  NO
    USE NVCUVID:                 NO
    NVIDIA GPU arch:             11 12 13 20 21 30 35
    NVIDIA PTX archs:            30
    Use fast math:               NO

  OpenCL:
    Version:                     dynamic
    Include path:                /home/jeanpat/App/opencv-3.0.0-alpha/3rdparty/include/opencl/1.2
    Use AMDFFT:                  NO
    Use AMDBLAS:                 NO

  Python 2:
    Interpreter:                 /usr/bin/python2.7 (ver 2.7.6)
    Libraries:                   /usr/lib/x86_64-linux-gnu/libpython2.7.so (ver 2.7.6)
    numpy:                       /usr/local/lib/python2.7/dist-packages/numpy/core/include (ver 1.9.0)
    packages path:               lib/python2.7/dist-packages

  Python 3:
    Interpreter:                 /usr/bin/python3.4 (ver 3.4)
    Libraries:                   /usr/lib/x86_64-linux-gnu/libpython3.4m.so (ver 3.4.0)
    numpy:                       /usr/lib/python3/dist-packages/numpy/core/include (ver 1.8.2)
    packages path:               lib/python3.4/dist-packages

  Python (for build):            /usr/bin/python2.7

  Java:
    ant:                         NO
    JNI:                         NO
    Java tests:                  NO

  Matlab:
    mex:                         NO

  Documentation:
    Build Documentation:         YES
    Sphinx:                      /usr/bin/sphinx-build (ver 1.2.2)
    PdfLaTeX compiler:           /usr/bin/pdflatex
    PlantUML:                    NO

  Tests and samples:
    Tests:                       YES
    Performance tests:           YES
    C/C++ Examples:              NO

  Install path:                  /usr/local

  cvconfig.h is in:              /home/jeanpat/App/open-cv-3.0.0-a BUILD
-----------------------------------------------------------------

Configuring done

ça à l'air d'aller , l'étape "generate" aussi. Depuis le répertoire cible, make bloque à 11%

                                                                                                      ^
Scanning dependencies of target opencv_core
[ 11%] Building CXX object modules/core/CMakeFiles/opencv_core.dir/src/kdtree.cpp.o
[ 11%] Building CXX object modules/core/CMakeFiles/opencv_core.dir/src/parallel.cpp.o
[ 11%] Building CXX object modules/core/CMakeFiles/opencv_core.dir/src/lpsolver.cpp.o
[ 14%] Building CXX object modules/core/CMakeFiles/opencv_core.dir/src/umatrix.cpp.o
/home/jeanpat/App/opencv-3.0.0-alpha/modules/core/src/umatrix.cpp:44:35: fatal error: opencl_kernels_core.hpp: Aucun fichier ou dossier de ce type
 #include "opencl_kernels_core.hpp"
                                   ^
compilation terminated.
make[2]: *** [modules/core/CMakeFiles/opencv_core.dir/src/umatrix.cpp.o] Erreur 1
make[1]: *** [modules/core/CMakeFiles/opencv_core.dir/all] Erreur 2
make: *** [all] Erreur 2

Un petit tour dans synaptic montre que différentes lib avec opencl dont
opencl-headers , ocl-icd-opencl-dev sont installées

une idée?

merci

#12 Re : -1 »  Compiler opencv3 alpha avec support cuda: opencl_kernels_core.hpp ? » Le 07/11/2014, à 14:52

xanmoo
Réponses : 6

C'est bizarre, ce fichier se trouve dans un répertoire généré pendant l'exécution de la commande make :

/home/jeanpat/App/open-cv-3.0.0-a\ BUILD/modules/core

Ce répertoire est crée au moment du message d'erreur, lorsque je lance la commande

make

depuis le répertoire cible:

/home/jeanpat/App/open-cv-3.0.0-a BUILD

#13 Re : -1 »  Compiler opencv3 alpha avec support cuda: opencl_kernels_core.hpp ? » Le 08/11/2014, à 10:42

xanmoo
Réponses : 6

bon ben pas d'espace dans le nom du répertoire cible, ça marche beaucoup mieux ... roll

merci

#14 -1 »  Touchpad gelé avec pilote nvidia (degel par ctrl+F6 et ctrl+F7) » Le 06/11/2014, à 14:03

xanmoo
Réponses : 2

Bonjour à tous,

Je suis l'heureux proprio d'un portable ldlc saturn : cpu i5 avec carte intel integrée + GPU NVidia 740M.
Quand on bascule l'affichage sous NVidia, il arrive que le curseur soit gelé (touchpad ou souris). La solution que j'ai trouvé consiste à basculer dans une console par CTRL+F6 puis à revenir dans l'affichage graphique par CTRL+F7.
C'est pas dramatique mais ça craint un peu quand même, je ne me voit pas faire cette manip au milieu d'une présentation.

Comment debuguer la chose?

Merci

Jean patrick

#15 Re : -1 »  Touchpad gelé avec pilote nvidia (degel par ctrl+F6 et ctrl+F7) » Le 07/11/2014, à 09:37

xanmoo
Réponses : 2

Argh!!
Est-ce que tu sais si on peut utiliser CUDA ( ex pycuda) sans que le pilote nvidia soit activé?
J'ai remarqué aussi que le branchement à chaud d'un vidéoprojecteur avec le pilote intel échouait (c'est à dire que le bureau était visible mais pas les applications!! Au passage les utilisateurs d'un portable sous windows 8 ne se posent pas de question,on branche et ça marche ...) est-ce que le branchement à chaud fonctionne avec nvidia?

Blabladodo a écrit :

l'utilisation d'une souris à part permet de contourner le bug,

C'est pas sur, le bug s'est quand même produit avec une souris... mais je n'avais relancé la session.

#16 -1 »  Choix portable Nvidia (LDLC, MSI, occasion Thinkpad W520) » Le 30/08/2014, à 16:00

xanmoo
Réponses : 0

Bonjour à tous,

Mon vieux portable nx6110 (celeron, 1 Go RAM) ayant rendu l'âme, j'ai décidé de casser ma tirelire pour un nouveau portable.
Objectif : une machine puissante, solide, silencieuse  pour
         * travailler (bcp de texte, virtualisation ou PlayOnLinux pour faire tourner des appli windows:atelier scientifique)
         * un peu de dev python si le temps ( python-opencv, CUDA / pyCUDA)
         * aucune  galère à l'installation.

Je louche vers:

MSI, LDLC  aurore / saturne

J'ai également vu en occasion un thinkpad W520 pour 680 ou moins de 750€. (intel i7 deuxième génération, 16 Go Ram ! Nvidia quadro 1000M).

Je penche un peu vers  le ldlc saturne (silencieux, HD, ...). Le MSI semble également bien reconnu et assez sexy (son, finition ... ).

Ai je oublié un point de comparaison? Si vous possédé une de ces machines, tout fonctionne-t-il bien?

Merci par avance

JP

#17 Re : -1 »  SolydXK, vous connaissez ? » Le 14/08/2014, à 15:02

xanmoo
Réponses : 12

J'ai installé solydk sur mon vieux thinkpad r51e (ram 2Go) devenu incompatible avec ubuntu (non PAE). Quelques pb aléatoires à cause du gpu intel 855GM. La distrib est vraiment sympa.

#18 Re : -1 »  MAJ lubuntu 14.04 echec partiel (noyau non PAE sur ORDINOSAURE) » Le 26/04/2014, à 22:43

xanmoo
Réponses : 20

Pour l'instant le noyau de la 13.10 fait tourner la boutique ...

#19 Re : -1 »  MAJ lubuntu 14.04 echec partiel (noyau non PAE sur ORDINOSAURE) » Le 28/04/2014, à 17:09

xanmoo
Réponses : 20

désolé d'avoir loupé ta réponse.

On a donc

Lecture des listes de paquets... Fait
Construction de l'arbre des dépendances       
Lecture des informations d'état... Fait
Vous pouvez lancer « apt-get -f install » pour corriger ces problèmes.
Les paquets suivants contiennent des dépendances non satisfaites :
 linux-image-extra-3.13.0-24-generic : Dépend: linux-image-3.13.0-24-generic mais il n'est pas installé
 linux-image-generic : Dépend: linux-image-3.13.0-24-generic mais il n'est pas installé
E: Dépendances manquantes. Essayez d'utiliser l'option -f.

donc apt-get -f install échoue à cause du non support des vieux ordi; et j'ai donc une trusty avec un vieux noyau (voir ci dessus):

$ cat /etc/lsb-release
DISTRIB_ID=Ubuntu
DISTRIB_RELEASE=14.04
DISTRIB_CODENAME=trusty
DISTRIB_DESCRIPTION="Ubuntu 14.04 LTS"

#20 Re : -1 »  MAJ lubuntu 14.04 echec partiel (noyau non PAE sur ORDINOSAURE) » Le 28/04/2014, à 17:42

xanmoo
Réponses : 20

On a donc

Les paquets supplémentaires suivants seront installés : 
  linux-image-3.13.0-24-generic
Paquets suggérés :
  fdutils linux-doc-3.13.0 linux-source-3.13.0 linux-tools
Les NOUVEAUX paquets suivants seront installés :
  linux-image-3.13.0-24-generic
0 mis à jour, 1 nouvellement installés, 0 à enlever et 2 non mis à jour.
3 partiellement installés ou enlevés.
Il est nécessaire de prendre 0 o/14,6 Mo dans les archives.
Après cette opération, 32,3 Mo d'espace disque supplémentaires seront utilisés.
Souhaitez-vous continuer ? [O/n] o
(Lecture de la base de données... 233397 fichiers et répertoires déjà installés.)
Préparation du décompactage de .../linux-image-3.13.0-24-generic_3.13.0-24.46_i386.deb ...
This kernel does not support a non-PAE CPU.
dpkg: error processing archive /var/cache/apt/archives/linux-image-3.13.0-24-generic_3.13.0-24.46_i386.deb (--unpack):
 le sous-processus nouveau script pre-installation a retourné une erreur de sortie d'état 1
Examining /etc/kernel/postrm.d .
run-parts: executing /etc/kernel/postrm.d/initramfs-tools 3.13.0-24-generic /boot/vmlinuz-3.13.0-24-generic
run-parts: executing /etc/kernel/postrm.d/zz-update-grub 3.13.0-24-generic /boot/vmlinuz-3.13.0-24-generic
Des erreurs ont été rencontrées pendant l'exécution :
 /var/cache/apt/archives/linux-image-3.13.0-24-generic_3.13.0-24.46_i386.deb
E: Sub-process /usr/bin/dpkg returned an error code (1)

C'est bien ça::
Préparation du décompactage de .../linux-image-3.13.0-24-generic_3.13.0-24.46_i386.deb ...
This kernel does not support a non-PAE CPU.

#21 Re : -1 »  MAJ lubuntu 14.04 echec partiel (noyau non PAE sur ORDINOSAURE) » Le 28/04/2014, à 18:17

xanmoo
Réponses : 20

@alca:
En effet c'est bizarre, il s'agissait d'une install neuve Lubuntu 13.10 ...

@nam1962:
Je vais rester sur une 14.04 avec un noyau de 13.10. Si je devais changer de distro, je passerais à une mint LMDE mate non pae ou à une crunchbang non pae, merci de ton attention.

#22 Re : -1 »  MAJ lubuntu 14.04 echec partiel (noyau non PAE sur ORDINOSAURE) » Le 30/04/2014, à 14:54

xanmoo
Réponses : 20

Un truc vache:
comme les paquets du noyau sont cassés, il est impossible de mettre à jour les autres paquets !! yikes

#23 Re : -1 »  MAJ lubuntu 14.04 echec partiel (noyau non PAE sur ORDINOSAURE) » Le 30/04/2014, à 15:30

xanmoo
Réponses : 20

desinstallation des paquets cassés+maj

#24 -1 »  Comment mettre à jour avec des paquets cassés (support cpu non pae) » Le 30/04/2014, à 14:59

xanmoo
Réponses : 0

Bonjour,
Après la mise à jour de 13.10 -> 14.04, j'ai un gros problème avec le noyau qui ne supporte plus les vieux cpu non pae discussion noyau no pae.

Y a-t-il une solution pour mettre à jour les autres paquets sans réparer les paquets cassés (c'est à dire le nouveau noyau qui ne supporte plus le cpu de mon ordi)?

merci