Contenu | Rechercher | Menus

Annonce

Si vous rencontrez des soucis à rester connecté sur le forum (ou si vous avez perdu votre mot de passe) déconnectez-vous et reconnectez-vous depuis cette page, en cochant la case "Me connecter automatiquement lors de mes prochaines visites". Attention, le forum rencontre actuellement quelques difficultés. En cas d'erreur 502, il ne faut pas re-valider l'envoi d'un message ou l'ouverture d'une discussion, au risque de créer un doublon.

La section divers se réorganise ! De nouvelles sous-sections à venir. (plus d'infos + donner son avis)

#1 Le 12/01/2014, à 16:13

nolem

virtual box - ne peut plus lancé une vm

Salut tout le monde,

Suite à mon souci et récupérer l'affichage de Ubuntu, j'ai quand même récupéré des petits ennuis. Virtualbox ne fonctionne plus correctement. En effet, le lancement d'une VM ne se fait plus. J'ai un message me disant de réinitialiser en mode root :

The VirtualBox Linux kernel driver (vboxdrv) is either not loaded or there is a permission problem with /dev/vboxdrv. Please reinstall the kernel module by executing

'/etc/init.d/vboxdrv setup'

as root. If it is available in your distribution, you should install the DKMS package first. This package keeps track of Linux kernel changes and recompiles the vboxdrv kernel module if necessary.

Donc je l'ai fait, mais encore une erreur :

sudo: /etc/init.d/vboxdrv: command not found

Je suis allé voir à cet endroit. Il y a rien. Alors j'ai fait un petit locate de vboxdrv et de virtualbox :

/lib/modules/3.2.0-29-generic-pae/updates/dkms/vboxdrv.ko
/usr/src/virtualbox-4.1.12/vboxdrv
/usr/src/virtualbox-4.1.12/vboxdrv/Makefile
/usr/src/virtualbox-4.1.12/vboxdrv/SUPDrv.c
/usr/src/virtualbox-4.1.12/vboxdrv/SUPDrvIDC.h
/usr/src/virtualbox-4.1.12/vboxdrv/SUPDrvIOC.h
/usr/src/virtualbox-4.1.12/vboxdrv/SUPDrvInternal.h
/usr/src/virtualbox-4.1.12/vboxdrv/SUPDrvSem.c
/usr/src/virtualbox-4.1.12/vboxdrv/VBox
/usr/src/virtualbox-4.1.12/vboxdrv/common
/usr/src/virtualbox-4.1.12/vboxdrv/do_Module.symvers
/usr/src/virtualbox-4.1.12/vboxdrv/generic
/usr/src/virtualbox-4.1.12/vboxdrv/include
/usr/src/virtualbox-4.1.12/vboxdrv/linux
/usr/src/virtualbox-4.1.12/vboxdrv/math
/usr/src/virtualbox-4.1.12/vboxdrv/product-generated.h
/usr/src/virtualbox-4.1.12/vboxdrv/r0drv
/usr/src/virtualbox-4.1.12/vboxdrv/version-generated.h
/usr/src/virtualbox-4.1.12/vboxdrv/linux/SUPDrv-linux.c
/var/lib/dkms/virtualbox/4.1.12/3.2.0-29-generic-pae/i686/module/vboxdrv.ko
/var/lib/dkms/virtualbox/4.1.12/build/vboxdrv
/var/lib/dkms/virtualbox/4.1.12/build/.tmp_versions/vboxdrv.mod
/var/lib/dkms/virtualbox/4.1.12/build/vboxdrv/.SUPDrv.o.cmd
/var/lib/dkms/virtualbox/4.1.12/build/vboxdrv/.SUPDrvSem.o.cmd
/var/lib/dkms/virtualbox/4.1.12/build/vboxdrv/.built-in.o.cmd
/var/lib/dkms/virtualbox/4.1.12/build/vboxdrv/.vboxdrv.ko.cmd
/var/lib/dkms/virtualbox/4.1.12/build/vboxdrv/.vboxdrv.mod.o.cmd
/var/lib/dkms/virtualbox/4.1.12/build/vboxdrv/.vboxdrv.o.cmd
/var/lib/dkms/virtualbox/4.1.12/build/vboxdrv/Makefile
/var/lib/dkms/virtualbox/4.1.12/build/vboxdrv/SUPDrv.c
/var/lib/dkms/virtualbox/4.1.12/build/vboxdrv/SUPDrv.o
/var/lib/dkms/virtualbox/4.1.12/build/vboxdrv/SUPDrvIDC.h
/var/lib/dkms/virtualbox/4.1.12/build/vboxdrv/SUPDrvIOC.h
/var/lib/dkms/virtualbox/4.1.12/build/vboxdrv/SUPDrvInternal.h
/var/lib/dkms/virtualbox/4.1.12/build/vboxdrv/SUPDrvSem.c
/var/lib/dkms/virtualbox/4.1.12/build/vboxdrv/SUPDrvSem.o
/var/lib/dkms/virtualbox/4.1.12/build/vboxdrv/VBox
/var/lib/dkms/virtualbox/4.1.12/build/vboxdrv/built-in.o
/var/lib/dkms/virtualbox/4.1.12/build/vboxdrv/common
/var/lib/dkms/virtualbox/4.1.12/build/vboxdrv/do_Module.symvers
/var/lib/dkms/virtualbox/4.1.12/build/vboxdrv/generic
/var/lib/dkms/virtualbox/4.1.12/build/vboxdrv/include
/var/lib/dkms/virtualbox/4.1.12/build/vboxdrv/linux
/var/lib/dkms/virtualbox/4.1.12/build/vboxdrv/math
/var/lib/dkms/virtualbox/4.1.12/build/vboxdrv/modules.order
/var/lib/dkms/virtualbox/4.1.12/build/vboxdrv/product-generated.h
/var/lib/dkms/virtualbox/4.1.12/build/vboxdrv/r0drv
/var/lib/dkms/virtualbox/4.1.12/build/vboxdrv/vboxdrv.ko
/var/lib/dkms/virtualbox/4.1.12/build/vboxdrv/vboxdrv.mod.c
/var/lib/dkms/virtualbox/4.1.12/build/vboxdrv/vboxdrv.mod.o
/var/lib/dkms/virtualbox/4.1.12/build/vboxdrv/vboxdrv.o
/var/lib/dkms/virtualbox/4.1.12/build/vboxdrv/version-generated.h
/var/lib/dkms/virtualbox/4.1.12/build/vboxdrv/linux/.SUPDrv-linux.o.cmd
/var/lib/dkms/virtualbox/4.1.12/build/vboxdrv/linux/SUPDrv-linux.c
/var/lib/dkms/virtualbox/4.1.12/build/vboxdrv/linux/SUPDrv-linux.o

J'ai cherché s'il existe la commande vboxdrv en faisant un whereis :

vboxdrv: /usr/src/virtualbox-4.1.12/vboxdrv

Que je fasse sudo /usr/src/virtualbox-4.1.12/vboxdrv ou sudo vboxdrv setup -> commande not found.

Aussi, j'ai fait une désinstalle par le software center et même fini de virer les paquets virtualbox. J'aimerai faire un purge, mais je ne connais pas sur quel paquet tapé. Après, j'ai retenté une installe. Le software center me renvoi de beaux messages d'erreurs. Un fois installé, ça fonctionne toujours pas.

Auriez vous la gentillesse de me donner un coup de main ?




Bon dimanche et merci encore pour votre aide à venir


Pourquoi choisir Linux ? - Microsoft et Linux - conférence Richard Stallman
---------------------------------------------
ASUS X73S/K73SV - Ubuntu 12.04 (Gnome Shell) - OpenSuse 13.1 (Gnome Shell)
ASUS X101CH - Lubuntu 13.10

Hors ligne

#2 Le 12/01/2014, à 23:07

tiramiseb

Re : virtual box - ne peut plus lancé une vm

Salut,

il faut installer virtualbox-dkms en complément.
(désolé pour la brièveté du message, je suis sur mon téléphone)


Sébastien Maccagnoni-Munch - administrateur Linux depuis le XXe siècle
Consultant informatique indépendant - http://www.smm-informatique.fr
Geek et tout plein d'autres choses - http://www.tiramiseb.fr

En ligne

#3 Le 12/01/2014, à 23:11

jplemoine

Re : virtual box - ne peut plus lancé une vm

il suffit de faire

sudo apt-get install virtualbox-dkms 
sudo /etc/init.d/vboxdrv setup

Ça te demande le mot de passe : tu le tapes (attention, il n'y a rien à l'écran) et tu appuies sur la touche 'Entrée'.

Dernière modification par jplemoine (Le 12/01/2014, à 23:13)


Cordialement, Jean-Philippe.
Sous Ubuntu en système principal depuis 2009
Ubuntu 14.04 desktop (2 postes) & server (1 poste)

Hors ligne

#4 Le 13/01/2014, à 00:23

nolem

Re : virtual box - ne peut plus lancé une vm

Comme j'ai dit, cette commande ne fonctionne pas sad


Pourquoi choisir Linux ? - Microsoft et Linux - conférence Richard Stallman
---------------------------------------------
ASUS X73S/K73SV - Ubuntu 12.04 (Gnome Shell) - OpenSuse 13.1 (Gnome Shell)
ASUS X101CH - Lubuntu 13.10

Hors ligne

#5 Le 13/01/2014, à 00:29

jplemoine

Re : virtual box - ne peut plus lancé une vm

Non. tu as mis

sudo: /etc/init.d/vboxdrv: command not found

il n'y a pas de deux points après le sudo et il faut mettre setup

Donc, peux-tu faire un copier/coller des 2 commandes et donner le résultat. MERCI.


Cordialement, Jean-Philippe.
Sous Ubuntu en système principal depuis 2009
Ubuntu 14.04 desktop (2 postes) & server (1 poste)

Hors ligne

#6 Le 13/01/2014, à 08:47

tiramiseb

Re : virtual box - ne peut plus lancé une vm

Attention !

Avec virtualbox-dkms, il n'y a PAS BESOIN de vboxdrv : tout se fait seul.

En fait, pour fonctionner VirtualBox a besoin d'implanter un module à lui dans le noyau. C'est le but du script "vboxdrv".
Mais chez Debian (et donc chez Ubuntu), ils ont une super infra de gestion de modules tiers, qui s'appelle "dkms". Ce truc va compiler les modules qu'on lui demande, automatiquement, à chaque fois qu'on installe un nouveau noyau par un paquet. Du coup, quand le module de VirtualBox est géré par dkms (grace au paquet virtualbox-dkms), "vboxdrv" devient inutile : le module est automatiquement compilé à chaque mise à jour de noyau.

Vu que tu as installé virtualbox-dkms après coup, tu peux tenter la commande suivante pour compiler ce module :

sudo dkms autoinstall

Sébastien Maccagnoni-Munch - administrateur Linux depuis le XXe siècle
Consultant informatique indépendant - http://www.smm-informatique.fr
Geek et tout plein d'autres choses - http://www.tiramiseb.fr

En ligne

#7 Le 13/01/2014, à 08:48

tiramiseb

Re : virtual box - ne peut plus lancé une vm

jplemoine a écrit :

Non. tu as mis

sudo: /etc/init.d/vboxdrv: command not found

Mais non, ce n'est pas ce qu'il a tapé ! C'est le retour de sudo, qui dit que la commande /etc/init.d/vboxdrv n'existe pas !


Sébastien Maccagnoni-Munch - administrateur Linux depuis le XXe siècle
Consultant informatique indépendant - http://www.smm-informatique.fr
Geek et tout plein d'autres choses - http://www.tiramiseb.fr

En ligne

#8 Le 13/01/2014, à 13:39

nolem

Re : virtual box - ne peut plus lancé une vm

tiramiseb a écrit :
jplemoine a écrit :

Non. tu as mis

sudo: /etc/init.d/vboxdrv: command not found

Mais non, ce n'est pas ce qu'il a tapé ! C'est le retour de sudo, qui dit que la commande /etc/init.d/vboxdrv n'existe pas !

Exact, c'est bien le retour de la console.

J'ai essayé de lancer ta commande, impossible d'installer, erreur sur erreur (dans la console et alert sur le bureau) :

Kernel preparation unnecessary for this kernel.  Skipping...

Kernel preparation unnecessary for this kernel.  Skipping...

Building module:
cleaning build area...
Building module:
cleaning build area....
make KERNELRELEASE=3.8.0-35-generic....
make KERNELRELEASE=3.8.0-35-generic -C /lib/modules/3.8.0-35-generic/build M=/var/lib/dkms/virtualbox/4.1.12/build...........(bad exit status: 2)
Error! Bad return status for module build on kernel: 3.8.0-35-generic (i686)
Consult /var/lib/dkms/virtualbox/4.1.12/build/make.log for more information.
...........(bad exit status: 2)
Error! Bad return status for module build on kernel: 3.8.0-35-generic (i686)
Consult /var/lib/dkms/rt3090/2.4.0.4/build/make.log for more information.
terminal a écrit :

Consult /var/lib/dkms/rt3090/2.4.0.4/build/make.log for more information.

Je suis allé voir le log et je peux lire cela :

DKMS make.log for rt3090-2.4.0.4 for kernel 3.8.0-35-generic (i686)
lundi 13 janvier 2014, 13:31:26 (UTC+0100)
make -C tools
make[1]: entrant dans le répertoire « /var/lib/dkms/rt3090/2.4.0.4/build/tools »
gcc -g bin2h.c -o bin2h
make[1]: quittant le répertoire « /var/lib/dkms/rt3090/2.4.0.4/build/tools »
/var/lib/dkms/rt3090/2.4.0.4/build/tools/bin2h
cp -f os/linux/Makefile.6 /var/lib/dkms/rt3090/2.4.0.4/build/os/linux/Makefile
make -C /lib/modules/3.8.0-35-generic/build SUBDIRS=/var/lib/dkms/rt3090/2.4.0.4/build/os/linux modules
make[1]: entrant dans le répertoire « /usr/src/linux-headers-3.8.0-35-generic »
  CC [M]  /var/lib/dkms/rt3090/2.4.0.4/build/os/linux/../../common/crypt_md5.o
  CC [M]  /var/lib/dkms/rt3090/2.4.0.4/build/os/linux/../../common/crypt_sha2.o
  CC [M]  /var/lib/dkms/rt3090/2.4.0.4/build/os/linux/../../common/crypt_hmac.o
  CC [M]  /var/lib/dkms/rt3090/2.4.0.4/build/os/linux/../../common/crypt_aes.o
/var/lib/dkms/rt3090/2.4.0.4/build/os/linux/../../common/crypt_aes.c: In function ‘WscEncryptData’:
/var/lib/dkms/rt3090/2.4.0.4/build/os/linux/../../common/crypt_aes.c:1522:1: attention : the frame size of 1360 bytes is larger than 1024 bytes [-Wframe-larger-than=]
/var/lib/dkms/rt3090/2.4.0.4/build/os/linux/../../common/crypt_aes.c: In function ‘WscDecryptData’:
/var/lib/dkms/rt3090/2.4.0.4/build/os/linux/../../common/crypt_aes.c:1592:1: attention : the frame size of 1360 bytes is larger than 1024 bytes [-Wframe-larger-than=]
/var/lib/dkms/rt3090/2.4.0.4/build/os/linux/../../common/crypt_aes.c: In function ‘AES_GTK_KEY_WRAP’:
/var/lib/dkms/rt3090/2.4.0.4/build/os/linux/../../common/crypt_aes.c:2265:1: attention : the frame size of 1096 bytes is larger than 1024 bytes [-Wframe-larger-than=]
  CC [M]  /var/lib/dkms/rt3090/2.4.0.4/build/os/linux/../../common/crypt_arc4.o
  CC [M]  /var/lib/dkms/rt3090/2.4.0.4/build/os/linux/../../common/mlme.o
/var/lib/dkms/rt3090/2.4.0.4/build/os/linux/../../common/mlme.c: In function ‘BssTableSetEntry’:
/var/lib/dkms/rt3090/2.4.0.4/build/os/linux/../../common/mlme.c:5822:39: attention : operation on ‘Tab->BssOverlapNr’ may be undefined [-Wsequence-point]
/var/lib/dkms/rt3090/2.4.0.4/build/os/linux/../../common/mlme.c: In function ‘BssTableSortByRssi’:
/var/lib/dkms/rt3090/2.4.0.4/build/os/linux/../../common/mlme.c:6183:1: attention : the frame size of 1728 bytes is larger than 1024 bytes [-Wframe-larger-than=]
  CC [M]  /var/lib/dkms/rt3090/2.4.0.4/build/os/linux/../../common/cmm_wep.o
  CC [M]  /var/lib/dkms/rt3090/2.4.0.4/build/os/linux/../../common/action.o
  CC [M]  /var/lib/dkms/rt3090/2.4.0.4/build/os/linux/../../common/cmm_data.o
  CC [M]  /var/lib/dkms/rt3090/2.4.0.4/build/os/linux/../../common/rtmp_init.o
  CC [M]  /var/lib/dkms/rt3090/2.4.0.4/build/os/linux/../../common/cmm_tkip.o
  CC [M]  /var/lib/dkms/rt3090/2.4.0.4/build/os/linux/../../common/cmm_aes.o
  CC [M]  /var/lib/dkms/rt3090/2.4.0.4/build/os/linux/../../common/cmm_sync.o
  CC [M]  /var/lib/dkms/rt3090/2.4.0.4/build/os/linux/../../common/eeprom.o
  CC [M]  /var/lib/dkms/rt3090/2.4.0.4/build/os/linux/../../common/cmm_sanity.o
  CC [M]  /var/lib/dkms/rt3090/2.4.0.4/build/os/linux/../../common/cmm_info.o
  CC [M]  /var/lib/dkms/rt3090/2.4.0.4/build/os/linux/../../common/cmm_cfg.o
  CC [M]  /var/lib/dkms/rt3090/2.4.0.4/build/os/linux/../../common/cmm_wpa.o
  CC [M]  /var/lib/dkms/rt3090/2.4.0.4/build/os/linux/../../common/dfs.o
  CC [M]  /var/lib/dkms/rt3090/2.4.0.4/build/os/linux/../../common/spectrum.o
  CC [M]  /var/lib/dkms/rt3090/2.4.0.4/build/os/linux/../../common/rtmp_timer.o
  CC [M]  /var/lib/dkms/rt3090/2.4.0.4/build/os/linux/../../common/rt_channel.o
  CC [M]  /var/lib/dkms/rt3090/2.4.0.4/build/os/linux/../../common/cmm_profile.o
  CC [M]  /var/lib/dkms/rt3090/2.4.0.4/build/os/linux/../../common/cmm_asic.o
  CC [M]  /var/lib/dkms/rt3090/2.4.0.4/build/os/linux/../../common/cmm_cmd.o
  CC [M]  /var/lib/dkms/rt3090/2.4.0.4/build/os/linux/../../sta/assoc.o
  CC [M]  /var/lib/dkms/rt3090/2.4.0.4/build/os/linux/../../sta/auth.o
  CC [M]  /var/lib/dkms/rt3090/2.4.0.4/build/os/linux/../../sta/auth_rsp.o
  CC [M]  /var/lib/dkms/rt3090/2.4.0.4/build/os/linux/../../sta/sync.o
/var/lib/dkms/rt3090/2.4.0.4/build/os/linux/../../sta/sync.c: In function ‘PeerBeaconAtJoinAction’:
/var/lib/dkms/rt3090/2.4.0.4/build/os/linux/../../sta/sync.c:1085:1: attention : the frame size of 1300 bytes is larger than 1024 bytes [-Wframe-larger-than=]
/var/lib/dkms/rt3090/2.4.0.4/build/os/linux/../../sta/sync.c: In function ‘PeerBeaconAtScanAction’:
/var/lib/dkms/rt3090/2.4.0.4/build/os/linux/../../sta/sync.c:755:1: attention : the frame size of 1268 bytes is larger than 1024 bytes [-Wframe-larger-than=]
/var/lib/dkms/rt3090/2.4.0.4/build/os/linux/../../sta/sync.c: In function ‘PeerBeacon’:
/var/lib/dkms/rt3090/2.4.0.4/build/os/linux/../../sta/sync.c:1756:1: attention : the frame size of 1312 bytes is larger than 1024 bytes [-Wframe-larger-than=]
  CC [M]  /var/lib/dkms/rt3090/2.4.0.4/build/os/linux/../../sta/sanity.o
  CC [M]  /var/lib/dkms/rt3090/2.4.0.4/build/os/linux/../../sta/rtmp_data.o
  CC [M]  /var/lib/dkms/rt3090/2.4.0.4/build/os/linux/../../sta/connect.o
/var/lib/dkms/rt3090/2.4.0.4/build/os/linux/../../sta/connect.c: In function ‘CntlOidScanProc’:
/var/lib/dkms/rt3090/2.4.0.4/build/os/linux/../../sta/connect.c:314:1: attention : the frame size of 1752 bytes is larger than 1024 bytes [-Wframe-larger-than=]
  CC [M]  /var/lib/dkms/rt3090/2.4.0.4/build/os/linux/../../sta/wpa.o
  CC [M]  /var/lib/dkms/rt3090/2.4.0.4/build/os/linux/../../sta/ags.o
  CC [M]  /var/lib/dkms/rt3090/2.4.0.4/build/os/linux/../../sta/sta_cfg.o
  CC [M]  /var/lib/dkms/rt3090/2.4.0.4/build/os/linux/../../common/rtmp_init_inf.o
  CC [M]  /var/lib/dkms/rt3090/2.4.0.4/build/os/linux/../../os/linux/rt_profile.o
  CC [M]  /var/lib/dkms/rt3090/2.4.0.4/build/os/linux/../../os/linux/sta_ioctl.o
/var/lib/dkms/rt3090/2.4.0.4/build/os/linux/../../os/linux/sta_ioctl.c: In function ‘rt_ioctl_iwaplist’:
/var/lib/dkms/rt3090/2.4.0.4/build/os/linux/../../os/linux/sta_ioctl.c:592:1: attention : the frame size of 1288 bytes is larger than 1024 bytes [-Wframe-larger-than=]
/var/lib/dkms/rt3090/2.4.0.4/build/os/linux/../../os/linux/sta_ioctl.c: In function ‘rt_ioctl_siwmlme’:
/var/lib/dkms/rt3090/2.4.0.4/build/os/linux/../../os/linux/sta_ioctl.c:1962:1: attention : the frame size of 1652 bytes is larger than 1024 bytes [-Wframe-larger-than=]
In file included from /usr/src/linux-headers-3.8.0-35-generic/arch/x86/include/asm/uaccess.h:550:0,
                 from /usr/src/linux-headers-3.8.0-35-generic/arch/x86/include/asm/sections.h:5,
                 from /usr/src/linux-headers-3.8.0-35-generic/arch/x86/include/asm/hw_irq.h:26,
                 from include/linux/irq.h:358,
                 from /usr/src/linux-headers-3.8.0-35-generic/arch/x86/include/asm/hardirq.h:5,
                 from include/linux/hardirq.h:8,
                 from include/linux/interrupt.h:12,
                 from /var/lib/dkms/rt3090/2.4.0.4/build/include/os/rt_linux.h:40,
                 from /var/lib/dkms/rt3090/2.4.0.4/build/include/rtmp_os.h:32,
                 from /var/lib/dkms/rt3090/2.4.0.4/build/include/rt_config.h:62,
                 from /var/lib/dkms/rt3090/2.4.0.4/build/os/linux/../../os/linux/sta_ioctl.c:28:
In function ‘copy_from_user’,
    inlined from ‘RTMPSetInformation’ at /var/lib/dkms/rt3090/2.4.0.4/build/os/linux/../../os/linux/sta_ioctl.c:3046:28:
/usr/src/linux-headers-3.8.0-35-generic/arch/x86/include/asm/uaccess_32.h:211:26: attention : call to ‘copy_from_user_overflow’ declared with attribute warning: copy_from_user() buffer size is not provably correct [enabled by default]
In function ‘copy_from_user’,
    inlined from ‘RTMPSetInformation’ at /var/lib/dkms/rt3090/2.4.0.4/build/os/linux/../../os/linux/sta_ioctl.c:3522:28:
/usr/src/linux-headers-3.8.0-35-generic/arch/x86/include/asm/uaccess_32.h:211:26: attention : call to ‘copy_from_user_overflow’ declared with attribute warning: copy_from_user() buffer size is not provably correct [enabled by default]
/var/lib/dkms/rt3090/2.4.0.4/build/os/linux/../../os/linux/sta_ioctl.c: In function ‘RTMPIoctlMAC’:
/var/lib/dkms/rt3090/2.4.0.4/build/os/linux/../../os/linux/sta_ioctl.c:5826:1: attention : the frame size of 1340 bytes is larger than 1024 bytes [-Wframe-larger-than=]
/var/lib/dkms/rt3090/2.4.0.4/build/os/linux/../../os/linux/sta_ioctl.c: In function ‘RTMPIoctlE2PROM’:
/var/lib/dkms/rt3090/2.4.0.4/build/os/linux/../../os/linux/sta_ioctl.c:6025:1: attention : the frame size of 1340 bytes is larger than 1024 bytes [-Wframe-larger-than=]
  CC [M]  /var/lib/dkms/rt3090/2.4.0.4/build/os/linux/../../os/linux/rt_linux.o
/var/lib/dkms/rt3090/2.4.0.4/build/os/linux/../../os/linux/rt_linux.c: In function ‘RtmpOSNetDevDetach’:
/var/lib/dkms/rt3090/2.4.0.4/build/os/linux/../../os/linux/rt_linux.c:1701:38: attention : initialization discards ‘const’ qualifier from pointer target type [enabled by default]
/var/lib/dkms/rt3090/2.4.0.4/build/os/linux/../../os/linux/rt_linux.c: In function ‘RtmpOSNetDevAttach’:
/var/lib/dkms/rt3090/2.4.0.4/build/os/linux/../../os/linux/rt_linux.c:1738:38: attention : initialization discards ‘const’ qualifier from pointer target type [enabled by default]
  CC [M]  /var/lib/dkms/rt3090/2.4.0.4/build/os/linux/../../os/linux/rt_main_dev.o
/var/lib/dkms/rt3090/2.4.0.4/build/os/linux/../../os/linux/rt_main_dev.c: In function ‘MainVirtualIF_close’:
/var/lib/dkms/rt3090/2.4.0.4/build/os/linux/../../os/linux/rt_main_dev.c:121:13: attention : unused variable ‘Cancelled’ [-Wunused-variable]
  CC [M]  /var/lib/dkms/rt3090/2.4.0.4/build/os/linux/../../common/ba_action.o
  CC [M]  /var/lib/dkms/rt3090/2.4.0.4/build/os/linux/../../common/cmm_mac_pci.o
  CC [M]  /var/lib/dkms/rt3090/2.4.0.4/build/os/linux/../../common/cmm_data_pci.o
  CC [M]  /var/lib/dkms/rt3090/2.4.0.4/build/os/linux/../../common/ee_prom.o
  CC [M]  /var/lib/dkms/rt3090/2.4.0.4/build/os/linux/../../common/ee_efuse.o
  CC [M]  /var/lib/dkms/rt3090/2.4.0.4/build/os/linux/../../common/rtmp_mcu.o
/var/lib/dkms/rt3090/2.4.0.4/build/os/linux/../../common/rtmp_mcu.c: In function ‘RtmpAsicLoadFirmware’:
/var/lib/dkms/rt3090/2.4.0.4/build/os/linux/../../common/rtmp_mcu.c:352:2: attention : ISO C89 interdit les mélanges de déclarations et de code [-Wdeclaration-after-statement]
/var/lib/dkms/rt3090/2.4.0.4/build/os/linux/../../common/rtmp_mcu.c:355:2: attention : passing argument 1 of ‘writel’ makes integer from pointer without a cast [enabled by default]
/usr/src/linux-headers-3.8.0-35-generic/arch/x86/include/asm/io.h:63:1: note: expected ‘unsigned int’ but argument is of type ‘ULONG *’
/var/lib/dkms/rt3090/2.4.0.4/build/os/linux/../../common/rtmp_mcu.c:356:2: attention : format ‘%d’ expects argument of type ‘int’, but argument 2 has type ‘ULONG’ [-Wformat]
  CC [M]  /var/lib/dkms/rt3090/2.4.0.4/build/os/linux/../../chips/rt30xx.o
  CC [M]  /var/lib/dkms/rt3090/2.4.0.4/build/os/linux/../../common/rt_rf.o
  CC [M]  /var/lib/dkms/rt3090/2.4.0.4/build/os/linux/../../chips/rt3090.o
  CC [M]  /var/lib/dkms/rt3090/2.4.0.4/build/os/linux/../../os/linux/rt_pci_rbus.o
  CC [M]  /var/lib/dkms/rt3090/2.4.0.4/build/os/linux/../../os/linux/rt_rbus_pci_util.o
/var/lib/dkms/rt3090/2.4.0.4/build/os/linux/../../os/linux/rt_rbus_pci_util.c: In function ‘RTMP_AllocateRxPacketBuffer’:
/var/lib/dkms/rt3090/2.4.0.4/build/os/linux/../../os/linux/rt_rbus_pci_util.c:155:22: attention : transtypage d'un pointeur vers un entier de taille différente [-Wpointer-to-int-cast]
  CC [M]  /var/lib/dkms/rt3090/2.4.0.4/build/os/linux/../../os/linux/pci_main_dev.o
/var/lib/dkms/rt3090/2.4.0.4/build/os/linux/../../os/linux/pci_main_dev.c:37:23: erreur: expected ‘=’, ‘,’, ‘;’, ‘asm’ or ‘__attribute__’ before ‘rt2860_remove_one’
/var/lib/dkms/rt3090/2.4.0.4/build/os/linux/../../os/linux/pci_main_dev.c:38:22: erreur: expected ‘=’, ‘,’, ‘;’, ‘asm’ or ‘__attribute__’ before ‘rt2860_probe’
/var/lib/dkms/rt3090/2.4.0.4/build/os/linux/../../os/linux/pci_main_dev.c:60:46: erreur: expected ‘=’, ‘,’, ‘;’, ‘asm’ or ‘__attribute__’ before ‘__devinitdata’
/var/lib/dkms/rt3090/2.4.0.4/build/os/linux/../../os/linux/pci_main_dev.c:87:17: erreur: ‘rt2860_pci_tbl’ undeclared here (not in a function)
/var/lib/dkms/rt3090/2.4.0.4/build/os/linux/../../os/linux/pci_main_dev.c:88:17: erreur: ‘rt2860_probe’ undeclared here (not in a function)
/var/lib/dkms/rt3090/2.4.0.4/build/os/linux/../../os/linux/pci_main_dev.c:90:5: erreur: implicit declaration of function ‘__devexit_p’ [-Werror=implicit-function-declaration]
/var/lib/dkms/rt3090/2.4.0.4/build/os/linux/../../os/linux/pci_main_dev.c:90:29: erreur: ‘rt2860_remove_one’ undeclared here (not in a function)
/var/lib/dkms/rt3090/2.4.0.4/build/os/linux/../../os/linux/pci_main_dev.c:283:24: erreur: expected ‘=’, ‘,’, ‘;’, ‘asm’ or ‘__attribute__’ before ‘rt2860_probe’
/var/lib/dkms/rt3090/2.4.0.4/build/os/linux/../../os/linux/pci_main_dev.c:449:23: erreur: expected ‘=’, ‘,’, ‘;’, ‘asm’ or ‘__attribute__’ before ‘rt2860_remove_one’
/var/lib/dkms/rt3090/2.4.0.4/build/os/linux/../../os/linux/pci_main_dev.c: In function ‘RTMPrt3xSetPCIePowerLinkCtrl’:
/var/lib/dkms/rt3090/2.4.0.4/build/os/linux/../../os/linux/pci_main_dev.c:941:2: attention : format ‘%x’ expects argument of type ‘unsigned int’, but argument 2 has type ‘ULONG’ [-Wformat]
/var/lib/dkms/rt3090/2.4.0.4/build/os/linux/../../os/linux/pci_main_dev.c:974:5: attention : format ‘%x’ expects argument of type ‘unsigned int’, but argument 2 has type ‘ULONG’ [-Wformat]
/var/lib/dkms/rt3090/2.4.0.4/build/os/linux/../../os/linux/pci_main_dev.c:986:5: attention : format ‘%x’ expects argument of type ‘unsigned int’, but argument 2 has type ‘ULONG’ [-Wformat]
/var/lib/dkms/rt3090/2.4.0.4/build/os/linux/../../os/linux/pci_main_dev.c:949:11: attention : unused variable ‘vendor_id’ [-Wunused-variable]
/var/lib/dkms/rt3090/2.4.0.4/build/os/linux/../../os/linux/pci_main_dev.c:1000:2: attention : format ‘%x’ expects argument of type ‘unsigned int’, but argument 3 has type ‘ULONG’ [-Wformat]
/var/lib/dkms/rt3090/2.4.0.4/build/os/linux/../../os/linux/pci_main_dev.c:1027:3: attention : format ‘%x’ expects argument of type ‘unsigned int’, but argument 2 has type ‘ULONG’ [-Wformat]
/var/lib/dkms/rt3090/2.4.0.4/build/os/linux/../../os/linux/pci_main_dev.c:934:8: attention : unused variable ‘offset’ [-Wunused-variable]
/var/lib/dkms/rt3090/2.4.0.4/build/os/linux/../../os/linux/pci_main_dev.c:933:8: attention : unused variable ‘Vendor’ [-Wunused-variable]
/var/lib/dkms/rt3090/2.4.0.4/build/os/linux/../../os/linux/pci_main_dev.c: Hors de toute fonction :
/var/lib/dkms/rt3090/2.4.0.4/build/os/linux/../../os/linux/pci_main_dev.c:514:14: attention : ‘RTMPInitPCIeDevice’ defined but not used [-Wunused-function]
/var/lib/dkms/rt3090/2.4.0.4/build/os/linux/../../os/linux/pci_main_dev.c:73:1: erreur: ‘__mod_pci_device_table’ aliased to undefined symbol ‘rt2860_pci_tbl’
cc1: some warnings being treated as errors
make[2]: *** [/var/lib/dkms/rt3090/2.4.0.4/build/os/linux/../../os/linux/pci_main_dev.o] Erreur 1
make[1]: *** [_module_/var/lib/dkms/rt3090/2.4.0.4/build/os/linux] Erreur 2
make[1]: quittant le répertoire « /usr/src/linux-headers-3.8.0-35-generic »
make: *** [LINUX] Erreur 2

Pourquoi choisir Linux ? - Microsoft et Linux - conférence Richard Stallman
---------------------------------------------
ASUS X73S/K73SV - Ubuntu 12.04 (Gnome Shell) - OpenSuse 13.1 (Gnome Shell)
ASUS X101CH - Lubuntu 13.10

Hors ligne

#9 Le 13/01/2014, à 13:46

tiramiseb

Re : virtual box - ne peut plus lancé une vm

C'est quoi ce "rt3090" ? On dirait un pilote pour une carte wifi, d'où vient-il ?
C'est là-dessus que ça bloque.
Si ça se trouve, dkms est bloqué chez toi depuis bien longtemps...

Ubuntu ne propose aucun pilote spécifique « rt3090 » sous forme de module dkms (a priori, il semble que ce matériel est supporté par défaut).
Tu as installé quelque chose de spécifique pour ça ?


Sébastien Maccagnoni-Munch - administrateur Linux depuis le XXe siècle
Consultant informatique indépendant - http://www.smm-informatique.fr
Geek et tout plein d'autres choses - http://www.tiramiseb.fr

En ligne

#10 Le 13/01/2014, à 16:17

nolem

Re : virtual box - ne peut plus lancé une vm

tiramiseb a écrit :

C'est quoi ce "rt3090" ? On dirait un pilote pour une carte wifi, d'où vient-il ?
C'est là-dessus que ça bloque.
Si ça se trouve, dkms est bloqué chez toi depuis bien longtemps...

Ubuntu ne propose aucun pilote spécifique « rt3090 » sous forme de module dkms (a priori, il semble que ce matériel est supporté par défaut).
Tu as installé quelque chose de spécifique pour ça ?

Non j'ai pas le souvenir d'avoir installer quelque chose pour le rt3090 (connexion internet). Au début avec ma machine neuve et que je voulais installer le driver de la carte gaphique, j'avais cette erreur au démarrage. Puis avec une maj, le driver de la carte avait sauté et mis Intel® Sandybridge Mobile x86/MMX/SSE2. Ces jours ci, j'ai décidé d'installer le bon driver de la carte graphique sur la machine. Avec de vrais déboires (écran noire au démarrage), j'ai réussi à remettre l'affichage. Puis hier, grâce à ArchangeGabriel, j'ai installé le bon driver. (ArchangeGabriel, si tu passes par là : encore merci pour ton intervention ! Ca fonctionne super bien !).

Quand j'ai remis l'affichage, je commençais à voir les erreurs arrivées :
- software center (fonctionne sans message d'erreur désormais)
- rt3090
- virtual machine
- et maintenant tout le temps, au chargement d'Ubuntu (ne monte pas le cryptswap)

Je pense que j'ai eu la bonne idée de garder les message console lorsque j'ai voulu installé le pilote prorpio :
De mémoire, lorsque j'ai fait cette commande :

sudo apt-get install linux-generic-lts-raring xserver-xorg-lts-raring
terminal a écrit :

Error! Bad return status for module build on kernel: 3.8.0-35-generic (i686)
Consult /var/lib/dkms/virtualbox/4.1.12/build/make.log for more information.
Error! Bad return status for module build on kernel: 3.8.0-35-generic (i686)
Consult /var/lib/dkms/rt3090/2.4.0.4/build/make.log for more information.

après le reboot avec cette commande :

sudo apt-get install nvidia-319 nvidia-settings-319 nvidia-prime
terminal a écrit :

apt-get install nvidia-settings-319 nvidia-primeLecture des listes de paquets... Fait
Construction de l'arbre des dépendances       
Lecture des informations d'état... Fait
Le paquet suivant a été installé automatiquement et n'est plus nécessaire :
  libllvm3.0
Veuillez utiliser « apt-get autoremove » pour les supprimer.
Les paquets supplémentaires suivants seront installés :
  libvdpau1 screen-resolution-extra
Paquets suggérés :
  nvidia-vdpau-driver vdpau-driver
Les NOUVEAUX paquets suivants seront installés :
  libvdpau1 nvidia-prime nvidia-settings-319 screen-resolution-extra
0 mis à jour, 4 nouvellement installés, 0 à enlever et 21 non mis à jour.
Il est nécessaire de prendre 2 304 ko dans les archives.
Après cette opération, 4 816 ko d'espace disque supplémentaires seront utilisés.
Souhaitez-vous continuer [O/n] ?
Réception de : 1 http://mirror.ovh.net/ubuntu/ precise-updates/main libvdpau1 i386 0.4.1-3ubuntu1.1 [27,2 kB]
Réception de : 2 http://mirror.ovh.net/ubuntu/ precise-updates/main nvidia-prime all 0.4.2~hybrid0.0.1 [5 068 B]
Réception de : 3 http://mirror.ovh.net/ubuntu/ precise/main screen-resolution-extra all 0.14ubuntu2 [12,8 kB]
Réception de : 4 http://mirror.ovh.net/ubuntu/ precise-updates/main nvidia-settings-319 i386 319.32-0ubuntu0.0.1 [2 259 kB]
2 304 ko réceptionnés en 2s (1 055 ko/s)         
Sélection du paquet libvdpau1 précédemment désélectionné.
(Lecture de la base de données... 793361 fichiers et répertoires déjà installés.)
Dépaquetage de libvdpau1 (à partir de .../libvdpau1_0.4.1-3ubuntu1.1_i386.deb) ...
Sélection du paquet nvidia-prime précédemment désélectionné.
Dépaquetage de nvidia-prime (à partir de .../nvidia-prime_0.4.2~hybrid0.0.1_all.deb) ...
Sélection du paquet screen-resolution-extra précédemment désélectionné.
Dépaquetage de screen-resolution-extra (à partir de .../screen-resolution-extra_0.14ubuntu2_all.deb) ...
Sélection du paquet nvidia-settings-319 précédemment désélectionné.
Dépaquetage de nvidia-settings-319 (à partir de .../nvidia-settings-319_319.32-0ubuntu0.0.1_i386.deb) ...
Paramétrage de libvdpau1 (0.4.1-3ubuntu1.1) ...
Paramétrage de nvidia-prime (0.4.2~hybrid0.0.1) ...
Paramétrage de screen-resolution-extra (0.14ubuntu2) ...
Paramétrage de nvidia-settings-319 (319.32-0ubuntu0.0.1) ...
update-alternatives: avertissement: l'alternative /usr/lib/nvidia-settings-updates/ld.so.conf (qui fait partie du groupe de liens nvidia_settings_conf) n'a pas été trouvée. Suppression de la liste des alternatives.
update-alternatives: avertissement: l'alternative /usr/lib/nvidia-settings/ld.so.conf (qui fait partie du groupe de liens nvidia_settings_conf) n'a pas été trouvée. Suppression de la liste des alternatives.
update-alternatives: avertissement: /etc/alternatives/nvidia_settings_conf pointe dans le vide et sera mis à jour avec le choix le plus adapté.
update-alternatives: utilisation de « /usr/lib/nvidia-settings-319/ld.so.conf » pour fournir « /etc/ld.so.conf.d/nvidia_settings.conf » (nvidia_settings_conf) en mode automatique.
Traitement des actions différées (« triggers ») pour « libc-bin »...
ldconfig deferred processing now taking place
Traitement des actions différées (« triggers ») pour « bamfdaemon »...
Rebuilding /usr/share/applications/bamf.index...

Je te mets les deux logs des deux soucis :
virtual box (/var/lib/dkms/virtualbox/4.1.12/build/make.log)

make.log a écrit :

DKMS make.log for virtualbox-4.1.12 for kernel 3.8.0-35-generic (i686)
lundi 13 janvier 2014, 13:31:26 (UTC+0100)
make: entrant dans le répertoire « /usr/src/linux-headers-3.8.0-35-generic »
  LD      /var/lib/dkms/virtualbox/4.1.12/build/built-in.o
  LD      /var/lib/dkms/virtualbox/4.1.12/build/vboxdrv/built-in.o
  CC [M]  /var/lib/dkms/virtualbox/4.1.12/build/vboxdrv/linux/SUPDrv-linux.o
  CC [M]  /var/lib/dkms/virtualbox/4.1.12/build/vboxdrv/SUPDrv.o
  CC [M]  /var/lib/dkms/virtualbox/4.1.12/build/vboxdrv/SUPDrvSem.o
  CC [M]  /var/lib/dkms/virtualbox/4.1.12/build/vboxdrv/r0drv/alloc-r0drv.o
  CC [M]  /var/lib/dkms/virtualbox/4.1.12/build/vboxdrv/r0drv/initterm-r0drv.o
  CC [M]  /var/lib/dkms/virtualbox/4.1.12/build/vboxdrv/r0drv/memobj-r0drv.o
  CC [M]  /var/lib/dkms/virtualbox/4.1.12/build/vboxdrv/r0drv/mpnotification-r0drv.o
  CC [M]  /var/lib/dkms/virtualbox/4.1.12/build/vboxdrv/r0drv/powernotification-r0drv.o
  CC [M]  /var/lib/dkms/virtualbox/4.1.12/build/vboxdrv/r0drv/linux/assert-r0drv-linux.o
  CC [M]  /var/lib/dkms/virtualbox/4.1.12/build/vboxdrv/r0drv/linux/alloc-r0drv-linux.o
  CC [M]  /var/lib/dkms/virtualbox/4.1.12/build/vboxdrv/r0drv/linux/initterm-r0drv-linux.o
  CC [M]  /var/lib/dkms/virtualbox/4.1.12/build/vboxdrv/r0drv/linux/memobj-r0drv-linux.o
/var/lib/dkms/virtualbox/4.1.12/build/vboxdrv/r0drv/linux/memobj-r0drv-linux.c: In function ‘rtR0MemObjLinuxDoMmap’:
/var/lib/dkms/virtualbox/4.1.12/build/vboxdrv/r0drv/linux/memobj-r0drv-linux.c:1150:9: erreur: implicit declaration of function ‘do_mmap’ [-Werror=implicit-function-declaration]
/var/lib/dkms/virtualbox/4.1.12/build/vboxdrv/r0drv/linux/memobj-r0drv-linux.c: In function ‘rtR0MemObjNativeMapUser’:
/var/lib/dkms/virtualbox/4.1.12/build/vboxdrv/r0drv/linux/memobj-r0drv-linux.c:1416:38: erreur: ‘VM_RESERVED’ undeclared (first use in this function)
/var/lib/dkms/virtualbox/4.1.12/build/vboxdrv/r0drv/linux/memobj-r0drv-linux.c:1416:38: note: each undeclared identifier is reported only once for each function it appears in
cc1: some warnings being treated as errors
make[2]: *** [/var/lib/dkms/virtualbox/4.1.12/build/vboxdrv/r0drv/linux/memobj-r0drv-linux.o] Erreur 1
make[1]: *** [/var/lib/dkms/virtualbox/4.1.12/build/vboxdrv] Erreur 2
make: *** [_module_/var/lib/dkms/virtualbox/4.1.12/build] Erreur 2
make: quittant le répertoire « /usr/src/linux-headers-3.8.0-35-generic »

pour le rt3090 (/var/lib/dkms/rt3090/2.4.0.4/build/make.log)

make.log a écrit :

DKMS make.log for rt3090-2.4.0.4 for kernel 3.8.0-35-generic (i686)
lundi 13 janvier 2014, 13:31:26 (UTC+0100)
make -C tools
make[1]: entrant dans le répertoire « /var/lib/dkms/rt3090/2.4.0.4/build/tools »
gcc -g bin2h.c -o bin2h
make[1]: quittant le répertoire « /var/lib/dkms/rt3090/2.4.0.4/build/tools »
/var/lib/dkms/rt3090/2.4.0.4/build/tools/bin2h
cp -f os/linux/Makefile.6 /var/lib/dkms/rt3090/2.4.0.4/build/os/linux/Makefile
make -C /lib/modules/3.8.0-35-generic/build SUBDIRS=/var/lib/dkms/rt3090/2.4.0.4/build/os/linux modules
make[1]: entrant dans le répertoire « /usr/src/linux-headers-3.8.0-35-generic »
  CC [M]  /var/lib/dkms/rt3090/2.4.0.4/build/os/linux/../../common/crypt_md5.o
  CC [M]  /var/lib/dkms/rt3090/2.4.0.4/build/os/linux/../../common/crypt_sha2.o
  CC [M]  /var/lib/dkms/rt3090/2.4.0.4/build/os/linux/../../common/crypt_hmac.o
  CC [M]  /var/lib/dkms/rt3090/2.4.0.4/build/os/linux/../../common/crypt_aes.o
/var/lib/dkms/rt3090/2.4.0.4/build/os/linux/../../common/crypt_aes.c: In function ‘WscEncryptData’:
/var/lib/dkms/rt3090/2.4.0.4/build/os/linux/../../common/crypt_aes.c:1522:1: attention : the frame size of 1360 bytes is larger than 1024 bytes [-Wframe-larger-than=]
/var/lib/dkms/rt3090/2.4.0.4/build/os/linux/../../common/crypt_aes.c: In function ‘WscDecryptData’:
/var/lib/dkms/rt3090/2.4.0.4/build/os/linux/../../common/crypt_aes.c:1592:1: attention : the frame size of 1360 bytes is larger than 1024 bytes [-Wframe-larger-than=]
/var/lib/dkms/rt3090/2.4.0.4/build/os/linux/../../common/crypt_aes.c: In function ‘AES_GTK_KEY_WRAP’:
/var/lib/dkms/rt3090/2.4.0.4/build/os/linux/../../common/crypt_aes.c:2265:1: attention : the frame size of 1096 bytes is larger than 1024 bytes [-Wframe-larger-than=]
  CC [M]  /var/lib/dkms/rt3090/2.4.0.4/build/os/linux/../../common/crypt_arc4.o
  CC [M]  /var/lib/dkms/rt3090/2.4.0.4/build/os/linux/../../common/mlme.o
/var/lib/dkms/rt3090/2.4.0.4/build/os/linux/../../common/mlme.c: In function ‘BssTableSetEntry’:
/var/lib/dkms/rt3090/2.4.0.4/build/os/linux/../../common/mlme.c:5822:39: attention : operation on ‘Tab->BssOverlapNr’ may be undefined [-Wsequence-point]
/var/lib/dkms/rt3090/2.4.0.4/build/os/linux/../../common/mlme.c: In function ‘BssTableSortByRssi’:
/var/lib/dkms/rt3090/2.4.0.4/build/os/linux/../../common/mlme.c:6183:1: attention : the frame size of 1728 bytes is larger than 1024 bytes [-Wframe-larger-than=]
  CC [M]  /var/lib/dkms/rt3090/2.4.0.4/build/os/linux/../../common/cmm_wep.o
  CC [M]  /var/lib/dkms/rt3090/2.4.0.4/build/os/linux/../../common/action.o
  CC [M]  /var/lib/dkms/rt3090/2.4.0.4/build/os/linux/../../common/cmm_data.o
  CC [M]  /var/lib/dkms/rt3090/2.4.0.4/build/os/linux/../../common/rtmp_init.o
  CC [M]  /var/lib/dkms/rt3090/2.4.0.4/build/os/linux/../../common/cmm_tkip.o
  CC [M]  /var/lib/dkms/rt3090/2.4.0.4/build/os/linux/../../common/cmm_aes.o
  CC [M]  /var/lib/dkms/rt3090/2.4.0.4/build/os/linux/../../common/cmm_sync.o
  CC [M]  /var/lib/dkms/rt3090/2.4.0.4/build/os/linux/../../common/eeprom.o
  CC [M]  /var/lib/dkms/rt3090/2.4.0.4/build/os/linux/../../common/cmm_sanity.o
  CC [M]  /var/lib/dkms/rt3090/2.4.0.4/build/os/linux/../../common/cmm_info.o
  CC [M]  /var/lib/dkms/rt3090/2.4.0.4/build/os/linux/../../common/cmm_cfg.o
  CC [M]  /var/lib/dkms/rt3090/2.4.0.4/build/os/linux/../../common/cmm_wpa.o
  CC [M]  /var/lib/dkms/rt3090/2.4.0.4/build/os/linux/../../common/dfs.o
  CC [M]  /var/lib/dkms/rt3090/2.4.0.4/build/os/linux/../../common/spectrum.o
  CC [M]  /var/lib/dkms/rt3090/2.4.0.4/build/os/linux/../../common/rtmp_timer.o
  CC [M]  /var/lib/dkms/rt3090/2.4.0.4/build/os/linux/../../common/rt_channel.o
  CC [M]  /var/lib/dkms/rt3090/2.4.0.4/build/os/linux/../../common/cmm_profile.o
  CC [M]  /var/lib/dkms/rt3090/2.4.0.4/build/os/linux/../../common/cmm_asic.o
  CC [M]  /var/lib/dkms/rt3090/2.4.0.4/build/os/linux/../../common/cmm_cmd.o
  CC [M]  /var/lib/dkms/rt3090/2.4.0.4/build/os/linux/../../sta/assoc.o
  CC [M]  /var/lib/dkms/rt3090/2.4.0.4/build/os/linux/../../sta/auth.o
  CC [M]  /var/lib/dkms/rt3090/2.4.0.4/build/os/linux/../../sta/auth_rsp.o
  CC [M]  /var/lib/dkms/rt3090/2.4.0.4/build/os/linux/../../sta/sync.o
/var/lib/dkms/rt3090/2.4.0.4/build/os/linux/../../sta/sync.c: In function ‘PeerBeaconAtJoinAction’:
/var/lib/dkms/rt3090/2.4.0.4/build/os/linux/../../sta/sync.c:1085:1: attention : the frame size of 1300 bytes is larger than 1024 bytes [-Wframe-larger-than=]
/var/lib/dkms/rt3090/2.4.0.4/build/os/linux/../../sta/sync.c: In function ‘PeerBeaconAtScanAction’:
/var/lib/dkms/rt3090/2.4.0.4/build/os/linux/../../sta/sync.c:755:1: attention : the frame size of 1268 bytes is larger than 1024 bytes [-Wframe-larger-than=]
/var/lib/dkms/rt3090/2.4.0.4/build/os/linux/../../sta/sync.c: In function ‘PeerBeacon’:
/var/lib/dkms/rt3090/2.4.0.4/build/os/linux/../../sta/sync.c:1756:1: attention : the frame size of 1312 bytes is larger than 1024 bytes [-Wframe-larger-than=]
  CC [M]  /var/lib/dkms/rt3090/2.4.0.4/build/os/linux/../../sta/sanity.o
  CC [M]  /var/lib/dkms/rt3090/2.4.0.4/build/os/linux/../../sta/rtmp_data.o
  CC [M]  /var/lib/dkms/rt3090/2.4.0.4/build/os/linux/../../sta/connect.o
/var/lib/dkms/rt3090/2.4.0.4/build/os/linux/../../sta/connect.c: In function ‘CntlOidScanProc’:
/var/lib/dkms/rt3090/2.4.0.4/build/os/linux/../../sta/connect.c:314:1: attention : the frame size of 1752 bytes is larger than 1024 bytes [-Wframe-larger-than=]
  CC [M]  /var/lib/dkms/rt3090/2.4.0.4/build/os/linux/../../sta/wpa.o
  CC [M]  /var/lib/dkms/rt3090/2.4.0.4/build/os/linux/../../sta/ags.o
  CC [M]  /var/lib/dkms/rt3090/2.4.0.4/build/os/linux/../../sta/sta_cfg.o
  CC [M]  /var/lib/dkms/rt3090/2.4.0.4/build/os/linux/../../common/rtmp_init_inf.o
  CC [M]  /var/lib/dkms/rt3090/2.4.0.4/build/os/linux/../../os/linux/rt_profile.o
  CC [M]  /var/lib/dkms/rt3090/2.4.0.4/build/os/linux/../../os/linux/sta_ioctl.o
/var/lib/dkms/rt3090/2.4.0.4/build/os/linux/../../os/linux/sta_ioctl.c: In function ‘rt_ioctl_iwaplist’:
/var/lib/dkms/rt3090/2.4.0.4/build/os/linux/../../os/linux/sta_ioctl.c:592:1: attention : the frame size of 1288 bytes is larger than 1024 bytes [-Wframe-larger-than=]
/var/lib/dkms/rt3090/2.4.0.4/build/os/linux/../../os/linux/sta_ioctl.c: In function ‘rt_ioctl_siwmlme’:
/var/lib/dkms/rt3090/2.4.0.4/build/os/linux/../../os/linux/sta_ioctl.c:1962:1: attention : the frame size of 1652 bytes is larger than 1024 bytes [-Wframe-larger-than=]
In file included from /usr/src/linux-headers-3.8.0-35-generic/arch/x86/include/asm/uaccess.h:550:0,
                 from /usr/src/linux-headers-3.8.0-35-generic/arch/x86/include/asm/sections.h:5,
                 from /usr/src/linux-headers-3.8.0-35-generic/arch/x86/include/asm/hw_irq.h:26,
                 from include/linux/irq.h:358,
                 from /usr/src/linux-headers-3.8.0-35-generic/arch/x86/include/asm/hardirq.h:5,
                 from include/linux/hardirq.h:8,
                 from include/linux/interrupt.h:12,
                 from /var/lib/dkms/rt3090/2.4.0.4/build/include/os/rt_linux.h:40,
                 from /var/lib/dkms/rt3090/2.4.0.4/build/include/rtmp_os.h:32,
                 from /var/lib/dkms/rt3090/2.4.0.4/build/include/rt_config.h:62,
                 from /var/lib/dkms/rt3090/2.4.0.4/build/os/linux/../../os/linux/sta_ioctl.c:28:
In function ‘copy_from_user’,
    inlined from ‘RTMPSetInformation’ at /var/lib/dkms/rt3090/2.4.0.4/build/os/linux/../../os/linux/sta_ioctl.c:3046:28:
/usr/src/linux-headers-3.8.0-35-generic/arch/x86/include/asm/uaccess_32.h:211:26: attention : call to ‘copy_from_user_overflow’ declared with attribute warning: copy_from_user() buffer size is not provably correct [enabled by default]
In function ‘copy_from_user’,
    inlined from ‘RTMPSetInformation’ at /var/lib/dkms/rt3090/2.4.0.4/build/os/linux/../../os/linux/sta_ioctl.c:3522:28:
/usr/src/linux-headers-3.8.0-35-generic/arch/x86/include/asm/uaccess_32.h:211:26: attention : call to ‘copy_from_user_overflow’ declared with attribute warning: copy_from_user() buffer size is not provably correct [enabled by default]
/var/lib/dkms/rt3090/2.4.0.4/build/os/linux/../../os/linux/sta_ioctl.c: In function ‘RTMPIoctlMAC’:
/var/lib/dkms/rt3090/2.4.0.4/build/os/linux/../../os/linux/sta_ioctl.c:5826:1: attention : the frame size of 1340 bytes is larger than 1024 bytes [-Wframe-larger-than=]
/var/lib/dkms/rt3090/2.4.0.4/build/os/linux/../../os/linux/sta_ioctl.c: In function ‘RTMPIoctlE2PROM’:
/var/lib/dkms/rt3090/2.4.0.4/build/os/linux/../../os/linux/sta_ioctl.c:6025:1: attention : the frame size of 1340 bytes is larger than 1024 bytes [-Wframe-larger-than=]
  CC [M]  /var/lib/dkms/rt3090/2.4.0.4/build/os/linux/../../os/linux/rt_linux.o
/var/lib/dkms/rt3090/2.4.0.4/build/os/linux/../../os/linux/rt_linux.c: In function ‘RtmpOSNetDevDetach’:
/var/lib/dkms/rt3090/2.4.0.4/build/os/linux/../../os/linux/rt_linux.c:1701:38: attention : initialization discards ‘const’ qualifier from pointer target type [enabled by default]
/var/lib/dkms/rt3090/2.4.0.4/build/os/linux/../../os/linux/rt_linux.c: In function ‘RtmpOSNetDevAttach’:
/var/lib/dkms/rt3090/2.4.0.4/build/os/linux/../../os/linux/rt_linux.c:1738:38: attention : initialization discards ‘const’ qualifier from pointer target type [enabled by default]
  CC [M]  /var/lib/dkms/rt3090/2.4.0.4/build/os/linux/../../os/linux/rt_main_dev.o
/var/lib/dkms/rt3090/2.4.0.4/build/os/linux/../../os/linux/rt_main_dev.c: In function ‘MainVirtualIF_close’:
/var/lib/dkms/rt3090/2.4.0.4/build/os/linux/../../os/linux/rt_main_dev.c:121:13: attention : unused variable ‘Cancelled’ [-Wunused-variable]
  CC [M]  /var/lib/dkms/rt3090/2.4.0.4/build/os/linux/../../common/ba_action.o
  CC [M]  /var/lib/dkms/rt3090/2.4.0.4/build/os/linux/../../common/cmm_mac_pci.o
  CC [M]  /var/lib/dkms/rt3090/2.4.0.4/build/os/linux/../../common/cmm_data_pci.o
  CC [M]  /var/lib/dkms/rt3090/2.4.0.4/build/os/linux/../../common/ee_prom.o
  CC [M]  /var/lib/dkms/rt3090/2.4.0.4/build/os/linux/../../common/ee_efuse.o
  CC [M]  /var/lib/dkms/rt3090/2.4.0.4/build/os/linux/../../common/rtmp_mcu.o
/var/lib/dkms/rt3090/2.4.0.4/build/os/linux/../../common/rtmp_mcu.c: In function ‘RtmpAsicLoadFirmware’:
/var/lib/dkms/rt3090/2.4.0.4/build/os/linux/../../common/rtmp_mcu.c:352:2: attention : ISO C89 interdit les mélanges de déclarations et de code [-Wdeclaration-after-statement]
/var/lib/dkms/rt3090/2.4.0.4/build/os/linux/../../common/rtmp_mcu.c:355:2: attention : passing argument 1 of ‘writel’ makes integer from pointer without a cast [enabled by default]
/usr/src/linux-headers-3.8.0-35-generic/arch/x86/include/asm/io.h:63:1: note: expected ‘unsigned int’ but argument is of type ‘ULONG *’
/var/lib/dkms/rt3090/2.4.0.4/build/os/linux/../../common/rtmp_mcu.c:356:2: attention : format ‘%d’ expects argument of type ‘int’, but argument 2 has type ‘ULONG’ [-Wformat]
  CC [M]  /var/lib/dkms/rt3090/2.4.0.4/build/os/linux/../../chips/rt30xx.o
  CC [M]  /var/lib/dkms/rt3090/2.4.0.4/build/os/linux/../../common/rt_rf.o
  CC [M]  /var/lib/dkms/rt3090/2.4.0.4/build/os/linux/../../chips/rt3090.o
  CC [M]  /var/lib/dkms/rt3090/2.4.0.4/build/os/linux/../../os/linux/rt_pci_rbus.o
  CC [M]  /var/lib/dkms/rt3090/2.4.0.4/build/os/linux/../../os/linux/rt_rbus_pci_util.o
/var/lib/dkms/rt3090/2.4.0.4/build/os/linux/../../os/linux/rt_rbus_pci_util.c: In function ‘RTMP_AllocateRxPacketBuffer’:
/var/lib/dkms/rt3090/2.4.0.4/build/os/linux/../../os/linux/rt_rbus_pci_util.c:155:22: attention : transtypage d'un pointeur vers un entier de taille différente [-Wpointer-to-int-cast]
  CC [M]  /var/lib/dkms/rt3090/2.4.0.4/build/os/linux/../../os/linux/pci_main_dev.o
/var/lib/dkms/rt3090/2.4.0.4/build/os/linux/../../os/linux/pci_main_dev.c:37:23: erreur: expected ‘=’, ‘,’, ‘;’, ‘asm’ or ‘__attribute__’ before ‘rt2860_remove_one’
/var/lib/dkms/rt3090/2.4.0.4/build/os/linux/../../os/linux/pci_main_dev.c:38:22: erreur: expected ‘=’, ‘,’, ‘;’, ‘asm’ or ‘__attribute__’ before ‘rt2860_probe’
/var/lib/dkms/rt3090/2.4.0.4/build/os/linux/../../os/linux/pci_main_dev.c:60:46: erreur: expected ‘=’, ‘,’, ‘;’, ‘asm’ or ‘__attribute__’ before ‘__devinitdata’
/var/lib/dkms/rt3090/2.4.0.4/build/os/linux/../../os/linux/pci_main_dev.c:87:17: erreur: ‘rt2860_pci_tbl’ undeclared here (not in a function)
/var/lib/dkms/rt3090/2.4.0.4/build/os/linux/../../os/linux/pci_main_dev.c:88:17: erreur: ‘rt2860_probe’ undeclared here (not in a function)
/var/lib/dkms/rt3090/2.4.0.4/build/os/linux/../../os/linux/pci_main_dev.c:90:5: erreur: implicit declaration of function ‘__devexit_p’ [-Werror=implicit-function-declaration]
/var/lib/dkms/rt3090/2.4.0.4/build/os/linux/../../os/linux/pci_main_dev.c:90:29: erreur: ‘rt2860_remove_one’ undeclared here (not in a function)
/var/lib/dkms/rt3090/2.4.0.4/build/os/linux/../../os/linux/pci_main_dev.c:283:24: erreur: expected ‘=’, ‘,’, ‘;’, ‘asm’ or ‘__attribute__’ before ‘rt2860_probe’
/var/lib/dkms/rt3090/2.4.0.4/build/os/linux/../../os/linux/pci_main_dev.c:449:23: erreur: expected ‘=’, ‘,’, ‘;’, ‘asm’ or ‘__attribute__’ before ‘rt2860_remove_one’
/var/lib/dkms/rt3090/2.4.0.4/build/os/linux/../../os/linux/pci_main_dev.c: In function ‘RTMPrt3xSetPCIePowerLinkCtrl’:
/var/lib/dkms/rt3090/2.4.0.4/build/os/linux/../../os/linux/pci_main_dev.c:941:2: attention : format ‘%x’ expects argument of type ‘unsigned int’, but argument 2 has type ‘ULONG’ [-Wformat]
/var/lib/dkms/rt3090/2.4.0.4/build/os/linux/../../os/linux/pci_main_dev.c:974:5: attention : format ‘%x’ expects argument of type ‘unsigned int’, but argument 2 has type ‘ULONG’ [-Wformat]
/var/lib/dkms/rt3090/2.4.0.4/build/os/linux/../../os/linux/pci_main_dev.c:986:5: attention : format ‘%x’ expects argument of type ‘unsigned int’, but argument 2 has type ‘ULONG’ [-Wformat]
/var/lib/dkms/rt3090/2.4.0.4/build/os/linux/../../os/linux/pci_main_dev.c:949:11: attention : unused variable ‘vendor_id’ [-Wunused-variable]
/var/lib/dkms/rt3090/2.4.0.4/build/os/linux/../../os/linux/pci_main_dev.c:1000:2: attention : format ‘%x’ expects argument of type ‘unsigned int’, but argument 3 has type ‘ULONG’ [-Wformat]
/var/lib/dkms/rt3090/2.4.0.4/build/os/linux/../../os/linux/pci_main_dev.c:1027:3: attention : format ‘%x’ expects argument of type ‘unsigned int’, but argument 2 has type ‘ULONG’ [-Wformat]
/var/lib/dkms/rt3090/2.4.0.4/build/os/linux/../../os/linux/pci_main_dev.c:934:8: attention : unused variable ‘offset’ [-Wunused-variable]
/var/lib/dkms/rt3090/2.4.0.4/build/os/linux/../../os/linux/pci_main_dev.c:933:8: attention : unused variable ‘Vendor’ [-Wunused-variable]
/var/lib/dkms/rt3090/2.4.0.4/build/os/linux/../../os/linux/pci_main_dev.c: Hors de toute fonction :
/var/lib/dkms/rt3090/2.4.0.4/build/os/linux/../../os/linux/pci_main_dev.c:514:14: attention : ‘RTMPInitPCIeDevice’ defined but not used [-Wunused-function]
/var/lib/dkms/rt3090/2.4.0.4/build/os/linux/../../os/linux/pci_main_dev.c:73:1: erreur: ‘__mod_pci_device_table’ aliased to undefined symbol ‘rt2860_pci_tbl’
cc1: some warnings being treated as errors
make[2]: *** [/var/lib/dkms/rt3090/2.4.0.4/build/os/linux/../../os/linux/pci_main_dev.o] Erreur 1
make[1]: *** [_module_/var/lib/dkms/rt3090/2.4.0.4/build/os/linux] Erreur 2
make[1]: quittant le répertoire « /usr/src/linux-headers-3.8.0-35-generic »
make: *** [LINUX] Erreur 2

Dernière modification par nolem (Le 13/01/2014, à 16:28)


Pourquoi choisir Linux ? - Microsoft et Linux - conférence Richard Stallman
---------------------------------------------
ASUS X73S/K73SV - Ubuntu 12.04 (Gnome Shell) - OpenSuse 13.1 (Gnome Shell)
ASUS X101CH - Lubuntu 13.10

Hors ligne

#11 Le 13/01/2014, à 16:24

nolem

Re : virtual box - ne peut plus lancé une vm

Ce qui me fait peur est que ça touche un fichier pour la connexion au net apparemment. Je me dis, si on y touche trop, ça va casser et plus de net sad. J'ai un live usb et un live cd pour au cas où (Samedi soir, le live CD m'a bien aidé).

En tout cas, je te remercie infiniment pour le coup de pouce.


Pourquoi choisir Linux ? - Microsoft et Linux - conférence Richard Stallman
---------------------------------------------
ASUS X73S/K73SV - Ubuntu 12.04 (Gnome Shell) - OpenSuse 13.1 (Gnome Shell)
ASUS X101CH - Lubuntu 13.10

Hors ligne

#12 Le 13/01/2014, à 16:29

tiramiseb

Re : virtual box - ne peut plus lancé une vm

Pour VBox, dans ce log-là, il y a quoi ? /var/lib/dkms/virtualbox/4.1.12/build/make.log

Pour le rt3090, il y a bien quelque chose, c'est forcément toi qui l'as mis (ou un lutin qui a utilisé ton PC en ton absence)...


Sébastien Maccagnoni-Munch - administrateur Linux depuis le XXe siècle
Consultant informatique indépendant - http://www.smm-informatique.fr
Geek et tout plein d'autres choses - http://www.tiramiseb.fr

En ligne

#13 Le 13/01/2014, à 16:32

nolem

Re : virtual box - ne peut plus lancé une vm

tiramiseb a écrit :

Pour VBox, dans ce log-là, il y a quoi ? /var/lib/dkms/virtualbox/4.1.12/build/make.log

Pour le rt3090, il y a bien quelque chose, c'est forcément toi qui l'as mis (ou un lutin qui a utilisé ton PC en ton absence)...

Je viens de rééditer le msg précédent et mis les logs. Arf je pensais pas que tu étais en train de lire mon sujet.

Pour le rt3090, je t'assure, j'ai rien fait.


Pourquoi choisir Linux ? - Microsoft et Linux - conférence Richard Stallman
---------------------------------------------
ASUS X73S/K73SV - Ubuntu 12.04 (Gnome Shell) - OpenSuse 13.1 (Gnome Shell)
ASUS X101CH - Lubuntu 13.10

Hors ligne

#14 Le 13/01/2014, à 17:01

tiramiseb

Re : virtual box - ne peut plus lancé une vm

Je viens de rééditer le msg précédent et mis les logs. Arf je pensais pas que tu étais en train de lire mon sujet.

Bah tu l'as posté, je l'ai lu tongue

Apparemment il y a un bug connu avec VirtualBox < 4.1.20 et les noyaux >= 3.5 qui empêche de compiler les modules... Il faut utiliser un noyau < 3.5 ou VirtualBox >= 4.1.20...

Pour le rt3090, je t'assure, j'ai rien fait.

Pourtant il est là...


Sébastien Maccagnoni-Munch - administrateur Linux depuis le XXe siècle
Consultant informatique indépendant - http://www.smm-informatique.fr
Geek et tout plein d'autres choses - http://www.tiramiseb.fr

En ligne

#15 Le 14/01/2014, à 20:02

nolem

Re : virtual box - ne peut plus lancé une vm

tiramiseb a écrit :

Je viens de rééditer le msg précédent et mis les logs. Arf je pensais pas que tu étais en train de lire mon sujet.

Bah tu l'as posté, je l'ai lu tongue

Apparemment il y a un bug connu avec VirtualBox < 4.1.20 et les noyaux >= 3.5 qui empêche de compiler les modules... Il faut utiliser un noyau < 3.5 ou VirtualBox >= 4.1.20...

Pour le rt3090, je t'assure, j'ai rien fait.

Pourtant il est là...

J'ai :
- désinstallé virtualbox via le software center,
- rebooté,
- allé sur https://www.virtualbox.org/wiki/Linux_Downloads pour prendre : VirtualBox 4.3.6
- téléchargé : Ubuntu 12.04 LTS ("Precise Pangolin")  i386
- installé ce paquet
- sortie de console sad :

terminal a écrit :

Selecting previously unselected package virtualbox-4.3.
dpkg: considering removing virtualbox in favour of virtualbox-4.3 ...
dpkg: no, cannot proceed with removal of virtualbox (--auto-deconfigure will help):
virtualbox-dkms depends on virtualbox (>= 4.1.12-dfsg-2ubuntu0.2)
  virtualbox is to be removed.
dpkg: regarding .../virtualbox-4.3_4.3.6-91406~Ubuntu~precise_i386.deb containing virtualbox-4.3:
virtualbox-4.3 conflicts with virtualbox
  virtualbox (version 4.1.12-dfsg-2ubuntu0.2) is present and installed.
dpkg: error processing /home/niuxe/Tlchargements/virtualbox-4.3_4.3.6-91406~Ubuntu~precise_i386.deb (--install):
conflicting packages - not installing virtualbox-4.3

Rallala, j'aimerai purger tout ça mais je ne sais pas sur quel paquet tapé et j'ai peur de faire une bonne connerie. hmm

Dernière modification par nolem (Le 14/01/2014, à 20:04)


Pourquoi choisir Linux ? - Microsoft et Linux - conférence Richard Stallman
---------------------------------------------
ASUS X73S/K73SV - Ubuntu 12.04 (Gnome Shell) - OpenSuse 13.1 (Gnome Shell)
ASUS X101CH - Lubuntu 13.10

Hors ligne

#16 Le 14/01/2014, à 20:10

tiramiseb

Re : virtual box - ne peut plus lancé une vm

Il faut enlever virtualbox-dkms, vu que le module ne sera alors plus celui des paquets Ubuntu, géré par dkms...


Sébastien Maccagnoni-Munch - administrateur Linux depuis le XXe siècle
Consultant informatique indépendant - http://www.smm-informatique.fr
Geek et tout plein d'autres choses - http://www.tiramiseb.fr

En ligne

#17 Le 14/01/2014, à 21:29

nolem

Re : virtual box - ne peut plus lancé une vm

Merci, ça fonctionne (du moins j'ai cette bonne impression).

Normalement lorsque j'ai désinstallé vbox via le software, il aurait dû virer les dkms, non ? J'ai fait une recherche sur les dkms. Maintenant, j'ai compris ce que c'est. Je vais me coucher moins con smile

Lorsque j'ai installé le pilote proprio nvidia, il me semble avoir vu des opérations sur ça et dans le linux-header généric (un truc du style). En tout cas, ça m'a bien planté la machine. J'ai plein de bug qui trainent maintenant (rt3090).

En tout cas un grand merci pour ton intervention. Tu m'as enlevé une bonne épine du pied. Je vais pouvoir installer une VM (vindo, juste pour IE10 et 11). Si j'arrive à le faire, je formate la petite machine que je viens de me payer et elle passe en full linux. Il n'y aura plus de raison du vindo.


Pourquoi choisir Linux ? - Microsoft et Linux - conférence Richard Stallman
---------------------------------------------
ASUS X73S/K73SV - Ubuntu 12.04 (Gnome Shell) - OpenSuse 13.1 (Gnome Shell)
ASUS X101CH - Lubuntu 13.10

Hors ligne

#18 Le 14/01/2014, à 21:36

tiramiseb

Re : virtual box - ne peut plus lancé une vm

Normalement lorsque j'ai désinstallé vbox via le software, il aurait dû virer les dkms, non ?

Es-tu sûr d'avoir désinstallé vbox ? Car le message « virtualbox (version 4.1.12-dfsg-2ubuntu0.2) is present and installed » indique clairement qu'il n'était pas désinstallé...


Sébastien Maccagnoni-Munch - administrateur Linux depuis le XXe siècle
Consultant informatique indépendant - http://www.smm-informatique.fr
Geek et tout plein d'autres choses - http://www.tiramiseb.fr

En ligne

#19 Le 14/01/2014, à 22:00

nolem

Re : virtual box - ne peut plus lancé une vm

Dans le software center il me proposait une installe après ma désinstalle (logique). A mon avis, je dois avoir un soucis dans les dkms ou ce qui touche au dkms. Tu as relevé le souci du rt3090 et là des trucs un peu bizarres. Pour désinstaller (virtualbox-dkms et virtualbox), je suis passé par synaptic.


Pourquoi choisir Linux ? - Microsoft et Linux - conférence Richard Stallman
---------------------------------------------
ASUS X73S/K73SV - Ubuntu 12.04 (Gnome Shell) - OpenSuse 13.1 (Gnome Shell)
ASUS X101CH - Lubuntu 13.10

Hors ligne

Haut de page ↑