Contenu | Rechercher | Menus

Annonce

Ubuntu 16.04 LTS
Commandez vos DVD et clés USB Ubuntu-fr !

Pour en savoir un peu plus sur l'équipe du forum.

Si vous avez des soucis pour rester connecté, déconnectez-vous puis reconnectez-vous depuis ce lien en cochant la case
Me connecter automatiquement lors de mes prochaines visites.

#1 Le 25/09/2017, à 10:12

hbamaxhba

Erreur de compilation

Bonjour

Lorsque je lance la compilation de mon projet avec la commande : cordova build android
je reçois le message suivant :

BUILD FAILED

Total time: 2 mins 50.504 secs

Error: /home/soboran/Bureau/MeteoHBA/firstApp/platforms/android/gradlew: Command failed with exit code 1 Error output:
/home/soboran/Android/Sdk/build-tools/26.0.1/aapt: 1: /home/soboran/Android/Sdk/build-tools/26.0.1/aapt: Syntax error: ")" unexpected

FAILURE: Build failed with an exception.

* What went wrong:
Execution failed for task ':CordovaLib:processDebugResources'.
> com.android.ide.common.process.ProcessException: Failed to execute aapt

* Try:
Run with --stacktrace option to get the stack trace. Run with --info or --debug option to get more log output.

Y a-t-il quel qu’un qui peut m’expliquer de quoi il s’agit

Merci


Modération : merci à l'avenir d'utiliser les balises code (explications ici).

Dernière modification par cqfd93 (Le 25/09/2017, à 10:27)

Hors ligne