Contenu | Rechercher | Menus

Annonce

L'équipe des administrateurs et modérateurs du forum vous invite à prendre connaissance des nouvelles règles.
En cas de besoin, vous pouvez intervenir dans cette discussion.

Si vous avez des soucis pour rester connecté, déconnectez-vous puis reconnectez-vous depuis ce lien en cochant la case
Me connecter automatiquement lors de mes prochaines visites.

À propos de l'équipe du forum.

#1 Le 14/03/2018, à 19:19

jbmuffat

Je n'arrive pas à compiler un pillote

Bonsoir,
je cherche à installer une clé wifi de TP-link modèle AC600.
J'ai téléchargé le fichier mais il faut compliler le pilote.
Cette fichue compilation plante et je ne comprends rien aux messages d'erreur.

1- peut-on joindre un fichier pdf au forum (dedans  il y la marche que j'essaie de suivre)
2- si je met le fichiers en compressé en pièce jointe, et mes messages d'erreurs, est-ce que vous sauriez me dire ce qui ne va pas?

Hors ligne

#2 Le 14/03/2018, à 19:35

xubu1957

Re : Je n'arrive pas à compiler un pillote

Bonjour,

C'est ce modèle > Archer-T2U. ?

C'est pas facile > wikidevi.com/wiki/TP-LINK_Archer_T2U

 ID 148f:761a Ralink Technology, Corp.

and is based on the MediaTek MT7610U chipset.
Until now there is no driver support for this chipset in the Linux kernel.
et est basé sur le chipset MediaTek MT7610U.
Jusqu'à présent, il n' y a pas de pilote pour ce chipset dans le noyau Linux.

Regarde dans > github.com/xtknight/mt7610u-linksys-ae6000-wifi-fixes


Important : Pensez à passer vos sujets en [Résolu] lorsque ceux-ci le sont, au début du titre en cliquant sur Modifier sous le premier message, et un bref récapitulatif de la solution à la fin de celui-ci. Merci.

Xubuntu 16.04.1 LTS : Lenovo T410 - Toshiba Satellite A300  Membre de Linux-Azur

Hors ligne

#3 Le 14/03/2018, à 20:25

jbmuffat

Re : Je n'arrive pas à compiler un pillote

je ne comprends rien. Je n'ai aucune idée de ce que je dois faire.
J'en ai ras l bol.

Hors ligne

#4 Le 14/03/2018, à 20:29

xubu1957

Re : Je n'arrive pas à compiler un pillote

C'est bien le modèle qui correspond au premier lien dans mon message #2 ?


Important : Pensez à passer vos sujets en [Résolu] lorsque ceux-ci le sont, au début du titre en cliquant sur Modifier sous le premier message, et un bref récapitulatif de la solution à la fin de celui-ci. Merci.

Xubuntu 16.04.1 LTS : Lenovo T410 - Toshiba Satellite A300  Membre de Linux-Azur

Hors ligne

#6 Le 14/03/2018, à 20:51

xubu1957

Re : Je n'arrive pas à compiler un pillote

C'est costaud :

traduction a écrit :

Connectez-vous à Internet par fil, puis exécutez dans le terminal

sudo apt-get install git build-essential
git clone https://github.com/Myria-de/mt7610u_wifi_sta_v3002_dpo_20130916.git
cd mt7610u_wifi_sta_v3002_dpo_20130916
make
sudo make install
sudo mkdir -p /etc/Wireless/RT2870STA
sudo cp RT2870STA.dat  /etc/Wireless/RT2870STA/RT2870STA.dat

Redémarrez.

Le dongle devrait fonctionner. Le seul problème est que vous devrez le réinstaller après chaque mise à niveau du noyau.

Mais si vous gardez le dossier du pilote mt7610u_wifi_sta_v3002_dpo_20130916, ce sera très facile.

Vous aurez besoin de faire seulement :

cd mt7610u_wifi_sta_v3002_dpo_20130916
make
sudo make install

après une mise à niveau du noyau.

Il est également possible de l'installer en utilisant DKMS. Dans ce cas, il se reconstruira automatiquement lors des mises à niveau du noyau.

> how-to-install-tp-link-t2uh-wireless-adapter-driver-ralink-mt7610u


Important : Pensez à passer vos sujets en [Résolu] lorsque ceux-ci le sont, au début du titre en cliquant sur Modifier sous le premier message, et un bref récapitulatif de la solution à la fin de celui-ci. Merci.

Xubuntu 16.04.1 LTS : Lenovo T410 - Toshiba Satellite A300  Membre de Linux-Azur

Hors ligne

#8 Le 14/03/2018, à 21:39

xubu1957

Re : Je n'arrive pas à compiler un pillote

Il y a ce lien > tutorials/computing/os/gnu-linux/driver/mt7610u-wifi.

indiqué dans :

Le 03/09/2017, ireachthesun a écrit :

Mission accomplie ! Grâce à Wicd...

Alors bilan :
Je suis sur Ubuntu 17.04 (zetty)
Pour les cartes wifi de type Mediatek MT7610, j'ai installé ce driver : https://github.com/chenhaiq/mt7610u_wif … o_20130916
Un tuto l'explique bien : http://www.nicola-spanti.info/fr/docume … -wifi.html
Ensuite je me suis rendu compte que Network-Manager (l'interface réseau de base d'Ubuntu) ne reconnaissait pas ma carte wifi. Du coup j'ai remplacé Network-Manager par un équivalent : Wicd
Problème : ça bloquait à l'étape "Obtention de l'adresse IP". Par conséquent, je me suis renseigné et suivi les indications de la documentation du chapitre 6.4.Réseau sans fil détecté mais impossible d'obtenir l'adresse IP de la page wifi.
Cela désactive totalement network-manager pour ne pas avoir de collision entre deux gestionnaires de réseaux.
Après cela, ça fonctionne, et je publie ce message depuis ma connexion wifi (qui m'a pris pas moins de 3 semaines de recherche à faire fonctionner sur ubuntu).

Merci beaucoup de votre aide ! Rien n'aurait été possible sans vous. Et surtout toi xubu1957, merci de ta disponibilité envers les néophytes en linux.

> [Résolu] Souci de compilation de pilote dongle wifi : MEDIATEK MT7601u

_ _ _

Rajout - Une discussion lancée aujourd'hui > [ubuntu] Installing TPlink T2u wireless driver dans le forum anglophone.

Dernière modification par xubu1957 (Le 14/03/2018, à 21:56)


Important : Pensez à passer vos sujets en [Résolu] lorsque ceux-ci le sont, au début du titre en cliquant sur Modifier sous le premier message, et un bref récapitulatif de la solution à la fin de celui-ci. Merci.

Xubuntu 16.04.1 LTS : Lenovo T410 - Toshiba Satellite A300  Membre de Linux-Azur

Hors ligne

#9 Le 14/03/2018, à 21:56

jbmuffat

Re : Je n'arrive pas à compiler un pillote

je prends pas à pas:

wget https://s3.amazonaws.com/mtk.cfs/Downloads/linux/mt7610u_wifi_sta_v3002_dpo_20130916.tar.bz2

donne

jb@jb-HP-Pavilion-Notebook:~$ wget https://s3.amazonaws.com/mtk.cfs/Downloads/linux/mt7610u_wifi_sta_v3002_dpo_20130916.tar.bz2
--2018-03-14 21:50:51--  https://s3.amazonaws.com/mtk.cfs/Downloads/linux/mt7610u_wifi_sta_v3002_dpo_20130916.tar.bz2
Résolution de s3.amazonaws.com (s3.amazonaws.com)… 52.216.129.117
Connexion à s3.amazonaws.com (s3.amazonaws.com)|52.216.129.117|:443… connecté.
requête HTTP transmise, en attente de la réponse… 200 OK
Taille : 1314602 (1,3M) [application/octet-stream]
Enregistre : «mt7610u_wifi_sta_v3002_dpo_20130916.tar.bz2.1»

mt7610u_wifi_sta_v3 100%[===================>]   1,25M   520KB/s    ds 2,5s    

2018-03-14 21:50:54 (520 KB/s) - «mt7610u_wifi_sta_v3002_dpo_20130916.tar.bz2.1» enregistré [1314602/1314602]

les 2 commandes suivantes:

jb@jb-HP-Pavilion-Notebook:~$ tar xjf mt7610u_wifi_sta_v3002_dpo_20130916.tar.bz2
jb@jb-HP-Pavilion-Notebook:~$ cd mt7610u_wifi_sta_v3002_dpo_20130916
jb@jb-HP-Pavilion-Notebook:~/mt7610u_wifi_sta_v3002_dpo_20130916$ 

Jusque là, çà va.

make

donne

jb@jb-HP-Pavilion-Notebook:~/mt7610u_wifi_sta_v3002_dpo_20130916$ make
make -C tools
make[1] : on entre dans le répertoire « /home/jb/mt7610u_wifi_sta_v3002_dpo_20130916/tools »
gcc -g bin2h.c -o bin2h
make[1] : on quitte le répertoire « /home/jb/mt7610u_wifi_sta_v3002_dpo_20130916/tools »
/home/jb/mt7610u_wifi_sta_v3002_dpo_20130916/tools/bin2h
chipset = mt7650u
chipset = mt7630u
chipset = mt7610u
cp -f os/linux/Makefile.6 /home/jb/mt7610u_wifi_sta_v3002_dpo_20130916/os/linux/Makefile
make -C /lib/modules/4.4.0-116-lowlatency/build SUBDIRS=/home/jb/mt7610u_wifi_sta_v3002_dpo_20130916/os/linux modules
make[1] : on entre dans le répertoire « /usr/src/linux-headers-4.4.0-116-lowlatency »
  CC [M]  /home/jb/mt7610u_wifi_sta_v3002_dpo_20130916/os/linux/../../sta/sta_cfg.o
/home/jb/mt7610u_wifi_sta_v3002_dpo_20130916/os/linux/../../sta/sta_cfg.c: In function ‘RTMPIoctlShow’:
/home/jb/mt7610u_wifi_sta_v3002_dpo_20130916/os/linux/../../sta/sta_cfg.c:5401:85: error: macro "__DATE__" might prevent reproducible builds [-Werror=date-time]
 intf(extra, size, "Driver version-%s, %s %s\n", STA_DRIVER_VERSION, __DATE__, _
                                                                     ^
/home/jb/mt7610u_wifi_sta_v3002_dpo_20130916/os/linux/../../sta/sta_cfg.c:5401:95: error: macro "__TIME__" might prevent reproducible builds [-Werror=date-time]
 , size, "Driver version-%s, %s %s\n", STA_DRIVER_VERSION, __DATE__, __TIME__ );
                                                                     ^
cc1: some warnings being treated as errors
scripts/Makefile.build:258 : la recette pour la cible « /home/jb/mt7610u_wifi_sta_v3002_dpo_20130916/os/linux/../../sta/sta_cfg.o » a échouée
make[2]: *** [/home/jb/mt7610u_wifi_sta_v3002_dpo_20130916/os/linux/../../sta/sta_cfg.o] Erreur 1
Makefile:1423 : la recette pour la cible « _module_/home/jb/mt7610u_wifi_sta_v3002_dpo_20130916/os/linux » a échouée
make[1]: *** [_module_/home/jb/mt7610u_wifi_sta_v3002_dpo_20130916/os/linux] Erreur 2
make[1] : on quitte le répertoire « /usr/src/linux-headers-4.4.0-116-lowlatency »
Makefile:393 : la recette pour la cible « LINUX » a échouée
make: *** [LINUX] Erreur 2
jb@jb-HP-Pavilion-Notebook:~/mt7610u_wifi_sta_v3002_dpo_20130916$ 

. Là, j'ai déjà quelques erreurs.

Et alors

make install

donne

make -C /home/jb/mt7610u_wifi_sta_v3002_dpo_20130916/os/linux -f Makefile.6 install
make[1] : on entre dans le répertoire « /home/jb/mt7610u_wifi_sta_v3002_dpo_20130916/os/linux »
mkdir: impossible de créer le répertoire «/etc/Wireless»: Le fichier existe
rm -rf /etc/Wireless/RT2860STA
rm: impossible de supprimer '/etc/Wireless/RT2860STA/RT2860STA.dat': Permission non accordée
Makefile.6:454 : la recette pour la cible « install » a échouée
make[1]: *** [install] Erreur 1
make[1] : on quitte le répertoire « /home/jb/mt7610u_wifi_sta_v3002_dpo_20130916/os/linux »
Makefile:489 : la recette pour la cible « install » a échouée
make: *** [install] Erreur 2
jb@jb-HP-Pavilion-Notebook:~/mt7610u_wifi_sta_v3002_dpo_20130916$ 

Avec sudo, çà donne

make -C /home/jb/mt7610u_wifi_sta_v3002_dpo_20130916/os/linux -f Makefile.6 install
make[1] : on entre dans le répertoire « /home/jb/mt7610u_wifi_sta_v3002_dpo_20130916/os/linux »
mkdir: impossible de créer le répertoire «/etc/Wireless»: Le fichier existe
rm -rf /etc/Wireless/RT2860STA
mkdir /etc/Wireless/RT2860STA
cp /home/jb/mt7610u_wifi_sta_v3002_dpo_20130916/conf/RT2860STA.dat /etc/Wireless/RT2860STA/.
install -d /lib/modules/4.4.0-116-lowlatency/kernel/drivers/net/wireless/
install -m 644 -c mt7650u_sta.ko /lib/modules/4.4.0-116-lowlatency/kernel/drivers/net/wireless/
install: impossible d'évaluer 'mt7650u_sta.ko': Aucun fichier ou dossier de ce type
Makefile.6:454 : la recette pour la cible « install » a échouée
make[1]: *** [install] Erreur 1
make[1] : on quitte le répertoire « /home/jb/mt7610u_wifi_sta_v3002_dpo_20130916/os/linux »
Makefile:489 : la recette pour la cible « install » a échouée
make: *** [install] Erreur 2
jb@jb-HP-Pavilion-Notebook:~/mt7610u_wifi_sta_v3002_dpo_20130916$ 

Hors ligne

#10 Le 14/03/2018, à 21:57

xubu1957

Re : Je n'arrive pas à compiler un pillote

Tu as vu les demandes de Naziel dans ton fil Wi-Fi ?


Important : Pensez à passer vos sujets en [Résolu] lorsque ceux-ci le sont, au début du titre en cliquant sur Modifier sous le premier message, et un bref récapitulatif de la solution à la fin de celui-ci. Merci.

Xubuntu 16.04.1 LTS : Lenovo T410 - Toshiba Satellite A300  Membre de Linux-Azur

Hors ligne

#11 Le 14/03/2018, à 22:03

jbmuffat

Re : Je n'arrive pas à compiler un pillote

je viens de le faire.

Merci à vous deux.

Hors ligne

#12 Le 15/03/2018, à 09:42

xubu1957

Re : Je n'arrive pas à compiler un pillote


Important : Pensez à passer vos sujets en [Résolu] lorsque ceux-ci le sont, au début du titre en cliquant sur Modifier sous le premier message, et un bref récapitulatif de la solution à la fin de celui-ci. Merci.

Xubuntu 16.04.1 LTS : Lenovo T410 - Toshiba Satellite A300  Membre de Linux-Azur

Hors ligne

#13 Le 19/03/2018, à 18:35

jbmuffat

Re : Je n'arrive pas à compiler un pillote

Il y a une version 3 du pilote mais je n'arrive pas plus à mes fins.
Le "mode d'emploi" est en anglais. Donc non seulement ce n'est pas ma langue mais on y fait faire "des choses" auxquelles je ne comprend rien.
Je pense que je rate quelque chose dans la compilation.
xubu 1957, si je t'envoies la doc -elle est courte- est-ce que tu m'expliquerais ce que je dois faire, en français profane?

Hors ligne

#14 Le 19/03/2018, à 18:45

xubu1957

Re : Je n'arrive pas à compiler un pillote

Je ne sais pas compiler.

Je suis un lambda qui se sert du moteur de recherche, je suis un motodidacte (spécialité niçoise). tongue

_ _ _

Y a-t-il une référence à Linux ou à un github ?

Dernière modification par xubu1957 (Le 19/03/2018, à 18:54)


Important : Pensez à passer vos sujets en [Résolu] lorsque ceux-ci le sont, au début du titre en cliquant sur Modifier sous le premier message, et un bref récapitulatif de la solution à la fin de celui-ci. Merci.

Xubuntu 16.04.1 LTS : Lenovo T410 - Toshiba Satellite A300  Membre de Linux-Azur

Hors ligne

#15 Le 20/03/2018, à 09:30

LeJediGris

Re : Je n'arrive pas à compiler un pillote

Salut,

Il faut éditer le fichier de make et mettre

-Wno-error=date-time 

comme paramètre dans les CFLAGS.

A+


%NOINDEX%
Matos Asus Zenbook 3 Deluxe UX490
"Home Made" Monstro: core i7 2600+16Go de mémoire+SSD C300 128Go SATAIII+MoBo Asus P8P67 DeLuxe avec Mint 18.3
+ "Terminator", Pentium 4 avec velociraptor, A la niche, place au Core 2 2660 aussi sous Mint 18.3, Freebox Revolution

Hors ligne

#16 Le 20/03/2018, à 10:06

michel_04

Re : Je n'arrive pas à compiler un pillote

Bonjour,

[HS]

xubu1957 a écrit :

je suis un motodidacte (spécialité niçoise). tongue

Référence au pilote de GP reconverti en homme politique ?
C'est vrai que c'était un bon pilote à l'époque.
[HS]

A+

Hors ligne

#17 Le 20/03/2018, à 10:12

LeJediGris

Re : Je n'arrive pas à compiler un pillote

Re-

Ou alors (c'est un PB de version de gcc sur ces macros...) les "virer" carrement du source, éditer

/home/jb/mt7610u_wifi_sta_v3002_dpo_20130916/os/linux/../../sta/sta_cfg.c

Faire une recherche dans l''éditeur de la ligne:

 intf(extra, size, "Driver version-%s, %s %s\n", STA_DRIVER_VERSION, __DATE__, __TIME__ );

pour y mettre seulement:

 intf(extra, size, "Driver version-%s\n", STA_DRIVER_VERSION);

A+


%NOINDEX%
Matos Asus Zenbook 3 Deluxe UX490
"Home Made" Monstro: core i7 2600+16Go de mémoire+SSD C300 128Go SATAIII+MoBo Asus P8P67 DeLuxe avec Mint 18.3
+ "Terminator", Pentium 4 avec velociraptor, A la niche, place au Core 2 2660 aussi sous Mint 18.3, Freebox Revolution

Hors ligne

#18 Le 20/03/2018, à 10:21

xubu1957

Re : Je n'arrive pas à compiler un pillote

Bonjour,


[HS]  @ michel_04

C'est dans sa page Wikipédia.

Il pilote bien sa carrière, maintenant.

C'est le mot qui m'a amusé.


                   [/HS]


Important : Pensez à passer vos sujets en [Résolu] lorsque ceux-ci le sont, au début du titre en cliquant sur Modifier sous le premier message, et un bref récapitulatif de la solution à la fin de celui-ci. Merci.

Xubuntu 16.04.1 LTS : Lenovo T410 - Toshiba Satellite A300  Membre de Linux-Azur

Hors ligne

#19 Le 20/03/2018, à 11:10

jbmuffat

Re : Je n'arrive pas à compiler un pillote

@LeJediGris
Ce fichier

/home/jb/mt7610u_wifi_sta_v3002_dpo_20130916/os/linux/../../sta/sta_cfg.c

je ne le trouve pas. Dans Linux je n'ai pas d'autres dossier que 1 dossier

.tmp_versions

, qui est vide.
Et pas de fichier

sta_cfg.c

ou

sta_cfg.o

Pour les CFLAGS, faut que je cherche la syntaxe ce soir.

Hors ligne

#20 Le 20/03/2018, à 21:44

jbmuffat

Re : Je n'arrive pas à compiler un pillote

@LeJediGris, Je croyais avoir répondu, mais non. Je recommence donc:
Alors au final j'ai pu faire la manip du message #17 puis j'ai fait "make"
çà donne:

jb@jb-HP-Pavilion-Notebook:~$ cd mt7610u_wifi_sta_v3002_dpo_20130916/
jb@jb-HP-Pavilion-Notebook:~/mt7610u_wifi_sta_v3002_dpo_20130916$ make
make -C tools
make[1] : on entre dans le répertoire « /home/jb/mt7610u_wifi_sta_v3002_dpo_20130916/tools »
gcc -g bin2h.c -o bin2h
make[1] : on quitte le répertoire « /home/jb/mt7610u_wifi_sta_v3002_dpo_20130916/tools »
/home/jb/mt7610u_wifi_sta_v3002_dpo_20130916/tools/bin2h
chipset = mt7650u
chipset = mt7630u
chipset = mt7610u
cp -f os/linux/Makefile.6 /home/jb/mt7610u_wifi_sta_v3002_dpo_20130916/os/linux/Makefile
make -C /lib/modules/4.4.0-116-lowlatency/build SUBDIRS=/home/jb/mt7610u_wifi_sta_v3002_dpo_20130916/os/linux modules
make[1] : on entre dans le répertoire « /usr/src/linux-headers-4.4.0-116-lowlatency »
  CC [M]  /home/jb/mt7610u_wifi_sta_v3002_dpo_20130916/os/linux/../../common/cmm_info.o
/home/jb/mt7610u_wifi_sta_v3002_dpo_20130916/os/linux/../../common/cmm_info.c: In function ‘Set_DriverVersion_Proc’:
/home/jb/mt7610u_wifi_sta_v3002_dpo_20130916/os/linux/../../common/cmm_info.c:47:97: error: macro "__DATE__" might prevent reproducible builds [-Werror=date-time]
 _TRACE, ("Driver version-%s %s %s\n", STA_DRIVER_VERSION, __DATE__, __TIME__));
                                                                              ^
/home/jb/mt7610u_wifi_sta_v3002_dpo_20130916/os/linux/../../common/cmm_info.c:47:97: error: macro "__TIME__" might prevent reproducible builds [-Werror=date-time]
In file included from /home/jb/mt7610u_wifi_sta_v3002_dpo_20130916/include/rtmp_os.h:44:0,
                 from /home/jb/mt7610u_wifi_sta_v3002_dpo_20130916/include/rtmp_comm.h:75,
                 from /home/jb/mt7610u_wifi_sta_v3002_dpo_20130916/include/rt_config.h:33,
                 from /home/jb/mt7610u_wifi_sta_v3002_dpo_20130916/os/linux/../../common/cmm_info.c:28:
/home/jb/mt7610u_wifi_sta_v3002_dpo_20130916/os/linux/../../common/cmm_info.c: In function ‘Set_DebugFunc_Proc’:
/home/jb/mt7610u_wifi_sta_v3002_dpo_20130916/os/linux/../../common/cmm_info.c:1084:30: warning: format ‘%x’ expects argument of type ‘unsigned int’, but argument 2 has type ‘ULONG {aka long unsigned int}’ [-Wformat=]
  DBGPRINT_S(RT_DEBUG_TRACE, ("Set RTDebugFunc = 0x%x\n", RTDebugFunc));
                              ^
/home/jb/mt7610u_wifi_sta_v3002_dpo_20130916/include/os/rt_linux.h:675:9: note: in definition of macro ‘DBGPRINT_S’
  printk Fmt;     \
         ^
/home/jb/mt7610u_wifi_sta_v3002_dpo_20130916/os/linux/../../common/cmm_info.c: In function ‘set_rf’:
/home/jb/mt7610u_wifi_sta_v3002_dpo_20130916/os/linux/../../common/cmm_info.c:5960:20: warning: format ‘%x’ expects argument of type ‘unsigned int *’, but argument 5 has type ‘UCHAR * {aka unsigned char *}’ [-Wformat=]
   rv = sscanf(arg, "%d-%d-%x", &(bank_id), &(rf_id), &(rf_val));
                    ^
cc1: some warnings being treated as errors
scripts/Makefile.build:258 : la recette pour la cible « /home/jb/mt7610u_wifi_sta_v3002_dpo_20130916/os/linux/../../common/cmm_info.o » a échouée
make[2]: *** [/home/jb/mt7610u_wifi_sta_v3002_dpo_20130916/os/linux/../../common/cmm_info.o] Erreur 1
Makefile:1423 : la recette pour la cible « _module_/home/jb/mt7610u_wifi_sta_v3002_dpo_20130916/os/linux » a échouée
make[1]: *** [_module_/home/jb/mt7610u_wifi_sta_v3002_dpo_20130916/os/linux] Erreur 2
make[1] : on quitte le répertoire « /usr/src/linux-headers-4.4.0-116-lowlatency »
Makefile:393 : la recette pour la cible « LINUX » a échouée
make: *** [LINUX] Erreur 2
jb@jb-HP-Pavilion-Notebook:~/mt7610u_wifi_sta_v3002_dpo_20130916$ 

Hors ligne

#21 Le 21/03/2018, à 11:34

LeJediGris

Re : Je n'arrive pas à compiler un pillote

Salut,

Bon je pense qu'il aurait fallu au moins faire un

sudo make clean

Avant... mais ceci dit j'ai trouvé ceci... à regarder par contre je pense qu'avant il faut nettoyer ce que tu as téléchargé/compilé.
Je n'ai pas relu son code python.

A+


%NOINDEX%
Matos Asus Zenbook 3 Deluxe UX490
"Home Made" Monstro: core i7 2600+16Go de mémoire+SSD C300 128Go SATAIII+MoBo Asus P8P67 DeLuxe avec Mint 18.3
+ "Terminator", Pentium 4 avec velociraptor, A la niche, place au Core 2 2660 aussi sous Mint 18.3, Freebox Revolution

Hors ligne

#22 Le 21/03/2018, à 19:11

jbmuffat

Re : Je n'arrive pas à compiler un pillote

çà part mal

jb@jb-HP-Pavilion-Notebook:~$ git clone --branch 2.0.0 git@github.com:ivannieto/archer-t2u-ubuntu-installer.git
Clonage dans 'archer-t2u-ubuntu-installer'...
Warning: Permanently added the RSA host key for IP address '192.30.253.113' to the list of known hosts.
Permission denied (publickey).
fatal: Could not read from remote repository.

Please make sure you have the correct access rights
and the repository exists.
jb@jb-HP-Pavilion-Notebook:~$ 

Hors ligne

#23 Le 22/03/2018, à 14:37

LeJediGris

Re : Je n'arrive pas à compiler un pillote

Salut

As-tu essayé de télécharger le zip ?, il faut choisir comme montre l'image (et les flèches...)
1521725765.jpg

A+


%NOINDEX%
Matos Asus Zenbook 3 Deluxe UX490
"Home Made" Monstro: core i7 2600+16Go de mémoire+SSD C300 128Go SATAIII+MoBo Asus P8P67 DeLuxe avec Mint 18.3
+ "Terminator", Pentium 4 avec velociraptor, A la niche, place au Core 2 2660 aussi sous Mint 18.3, Freebox Revolution

Hors ligne

#24 Le 22/03/2018, à 16:29

jbmuffat

Re : Je n'arrive pas à compiler un pillote

Sur le conseil d'un des animateurs du site, voilà ce que j'ai fait:

jb@jb-HP-Pavilion-Notebook:~$ cd driver\ wifi/
jb@jb-HP-Pavilion-Notebook:~/driver wifi$ cd archer-t2u-ubuntu-installer/
jb@jb-HP-Pavilion-Notebook:~/driver wifi/archer-t2u-ubuntu-installer$ git clone --branch 2.0.0 https://github.com/ivannieto/archer-t2u-ubuntu-installer.git
Clonage dans 'archer-t2u-ubuntu-installer'...
remote: Counting objects: 562, done.
remote: Total 562 (delta 0), reused 0 (delta 0), pack-reused 562
Réception d'objets: 100% (562/562), 1.74 MiB | 1.30 MiB/s, fait.
Résolution des deltas: 100% (277/277), fait.
Vérification de la connectivité... fait.
Note: checking out 'dee95801db725cc530896b6afa0ebd479c68595d'.

You are in 'detached HEAD' state. You can look around, make experimental
changes and commit them, and you can discard any commits you make in this
state without impacting any branches by performing another checkout.

If you want to create a new branch to retain commits you create, you may
do so (now or later) by using -b with the checkout command again. Example:

  git checkout -b <new-branch-name>

jb@jb-HP-Pavilion-Notebook:~/driver wifi/archer-t2u-ubuntu-installer$ cd archer-t2u-ubuntu-installer/ && python3 t2u-driver-installer.py
*************************

Please, disconnect all devices you're trying to install and press [I]: I
Please, disconnect all devices you're trying to install and press [I]: 

Mais à chaque fois que je presse "I", le message se répète.
Bien sûr, la clé wifi n'est pas connectée.

Hors ligne

#25 Le 22/03/2018, à 16:42

xubu1957

Re : Je n'arrive pas à compiler un pillote

Bonjour,

driver wifi/archer-t2u-ubuntu-installer$ git clone --branch 2.0.0 

C'est la version 2.0.0, du pilote pour la 17.10.

Pour une 16.04, il faudrait la version 1.0.0 https://github.com/ivannieto/archer-t2u … tree/1.0.0

Archer T2U Ubuntu installer
Installation:

You should have python3 installed properly.
Clone For Ubuntu 17.10 2.0.0
$ git clone --branch 2.0.0 git@github.com:ivannieto/archer-t2u-ubuntu-installer.git
Clone For Ubuntu 16.04 1.0.0
$ git clone --branch 2.0.0 git@github.com:ivannieto/archer-t2u-ubuntu-installer.git

dans github.com/ivannieto/archer-t2u-ubuntu-installer

Dernière modification par xubu1957 (Le 22/03/2018, à 16:43)


Important : Pensez à passer vos sujets en [Résolu] lorsque ceux-ci le sont, au début du titre en cliquant sur Modifier sous le premier message, et un bref récapitulatif de la solution à la fin de celui-ci. Merci.

Xubuntu 16.04.1 LTS : Lenovo T410 - Toshiba Satellite A300  Membre de Linux-Azur

Hors ligne