Contenu | Rechercher | Menus

Annonce

Ubuntu-fr.org recrute toujours de nouveaux modérateurs, avec de l'expérience.

Ubuntu 16.04 LTS
Réservez vos DVD et clé USB Ubuntu-fr (premières livraisons mi-mai)

Si vous avez des soucis pour rester connecté, déconnectez vous et reconnectez vous depuis ce lien en cochant le case
Me connecter automatiquement lors de mes prochaines visites.

M.A.J. en cours du forum possibilité de bug, nous faisons le maximum pour les résoudre au plus vite

#1 Le 27/05/2005, à 20:33

Vince1407

Juste besoin de savoir si vous savez se que sa veux dire !

Bonjour je suis revenu sur la Ubuntu , Warty ( parce que le cd de la Hoary a pas marché une seconde ) donc j'ai make et gcc et j'essais d'installer les pilotes de mon modem !

J'ai deja poster ici mais je voudrais juste savoir si quelqu'un peut me traduire ses obscures lignes pour me dire se que sa veux dire !

Le premier qui me dis qu'il faut faire un apt-get install <tel_package> je l'embroche wink ( je n'ai pas le net je le rappel , j'essai de le mettre )

vince@ubuntu:/usr/local/cxacru $ sudo make
cd init && make clean
make[1]: entrant dans le répertoire « /usr/local/cxacru/init »
rm -f cxload cxioctl cxloaddbg cxloaddbgt
make[1]: quittant le répertoire « /usr/local/cxacru/init »
cd module2 && make clean
make[1]: entrant dans le répertoire « /usr/local/cxacru/module2 »
rm -f *.o .*.flags *.ko *.mod.* .*.o.cmd .*.ko.cmd
make[1]: quittant le répertoire « /usr/local/cxacru/module2 »
cd sarlib && make clean
grep: /lib/modules/2.6.8.1-3-386/build/include/linux/atmdev.h: Aucun fichier ou répertoire de ce type
grep: /lib/modules/2.6.8.1-3-386/build/include/linux/atmdev.h: Aucun fichier ou répertoire de ce type
make[1]: entrant dans le répertoire « /usr/local/cxacru/sarlib »
/bin/rm -f *.o
make[1]: quittant le répertoire « /usr/local/cxacru/sarlib »
cd panel && make clean
make[1]: entrant dans le répertoire « /usr/local/cxacru/panel »
rm -f cxpanel *.bak
make[1]: quittant le répertoire « /usr/local/cxacru/panel »
cd bridged && make clean
make[1]: entrant dans le répertoire « /usr/local/cxacru/bridged »
rm -f br2684ctl
make[1]: quittant le répertoire « /usr/local/cxacru/bridged »
cd init && make && make install
make[1]: entrant dans le répertoire « /usr/local/cxacru/init »
gcc -O2 -Wstrict-prototypes -fomit-frame-pointer -pipe -march=i686 -Wall -DLINUX -I../include -lusb -lpthread cxload.c -o cxload
cxload.c:132:17: usb.h : Aucun fichier ou répertoire de ce type
Dans le fichier inclus à partir de cxload.c:133:
../include/usbi.h:4:17: usb.h : Aucun fichier ou répertoire de ce type
In file included from cxload.c:133:
../include/usbi.h:49: error: erreur d'analyse syntaxique before '*' token
../include/usbi.h:49: attention : function declaration isn't a prototype
../include/usbi.h:54: error: erreur d'analyse syntaxique before '*' token
../include/usbi.h:54: attention : function declaration isn't a prototype
../include/usbi.h:55: error: erreur d'analyse syntaxique before '*' token
../include/usbi.h:55: attention : function declaration isn't a prototype
cxload.c:236: error: erreur d'analyse syntaxique before '*' token
cxload.c:237: attention : function declaration isn't a prototype
cxload.c: Dans la fonction « transfer_ctrl_msg »:
cxload.c:247: attention : implicit declaration of function `usb_control_msg'
cxload.c:247: error: `adsl_handle' undeclared (first use in this function)
cxload.c:247: error: (Each undeclared identifier is reported only once
cxload.c:247: error: for each function it appears in.)
cxload.c:247: error: `requesttype' undeclared (first use in this function)
cxload.c:247: error: `request' undeclared (first use in this function)
cxload.c:247: error: `value' undeclared (first use in this function)
cxload.c:247: error: `buf' undeclared (first use in this function)
cxload.c:247: error: `size' undeclared (first use in this function)
cxload.c:257: attention : implicit declaration of function `usb_strerror'
cxload.c:257: attention : l'argument de format n'est pas un pointeur (arg 2)
cxload.c:259: attention : implicit declaration of function `usb_clear_halt'
cxload.c: Hors de toute fonction :
cxload.c:275: error: erreur d'analyse syntaxique before '*' token
cxload.c:276: attention : function declaration isn't a prototype
cxload.c: Dans la fonction « read_bulk »:
cxload.c:281: error: `buf' undeclared (first use in this function)
cxload.c:287: attention : implicit declaration of function `usb_bulk_read'
cxload.c:287: error: `adsl_handle' undeclared (first use in this function)
cxload.c:287: error: `ep' undeclared (first use in this function)
cxload.c:287: error: `size' undeclared (first use in this function)
cxload.c:297: attention : l'argument de format n'est pas un pointeur (arg 2)
cxload.c: Hors de toute fonction :
cxload.c:314: error: erreur d'analyse syntaxique before '*' token
cxload.c:315: attention : function declaration isn't a prototype
cxload.c: Dans la fonction « send_bulk »:
cxload.c:321: error: `nfil' undeclared (first use in this function)
cxload.c:327: attention : implicit declaration of function `usb_bulk_write'
cxload.c:327: error: `adsl_handle' undeclared (first use in this function)
cxload.c:327: error: `ep' undeclared (first use in this function)
cxload.c:327: error: `buf' undeclared (first use in this function)
cxload.c:327: error: `ncol' undeclared (first use in this function)
cxload.c:337: attention : l'argument de format n'est pas un pointeur (arg 2)
cxload.c: Hors de toute fonction :
cxload.c:383: error: erreur d'analyse syntaxique before '*' token
cxload.c:384: attention : function declaration isn't a prototype
cxload.c: Dans la fonction « dispatch_info »:
cxload.c:397: error: `adsl_handle' undeclared (first use in this function)
cxload.c:438: attention : l'argument de format n'est pas un pointeur (arg 2)
cxload.c:442: attention : implicit declaration of function `usb_resetep'
cxload.c:449: error: `timeout' undeclared (first use in this function)
cxload.c: Hors de toute fonction :
cxload.c:459: error: erreur d'analyse syntaxique before '*' token
cxload.c:460: attention : function declaration isn't a prototype
cxload.c: Dans la fonction « send_cmd_wait_answers »:
cxload.c:464: error: `adsl_handle' undeclared (first use in this function)
cxload.c:464: error: `buf' undeclared (first use in this function)
cxload.c:470: error: `answers' undeclared (first use in this function)
cxload.c:471: error: `wait' undeclared (first use in this function)
cxload.c:472: error: `timeout' undeclared (first use in this function)
cxload.c: Hors de toute fonction :
cxload.c:501: error: erreur d'analyse syntaxique before '*' token
cxload.c:502: attention : function declaration isn't a prototype
cxload.c: Dans la fonction « write_value »:
cxload.c:506: error: `value' undeclared (first use in this function)
cxload.c:510: error: `address' undeclared (first use in this function)
cxload.c:511: error: `adsl_handle' undeclared (first use in this function)
cxload.c: Hors de toute fonction :
cxload.c:518: error: erreur d'analyse syntaxique before '*' token
cxload.c:519: attention : function declaration isn't a prototype
cxload.c: Dans la fonction « send_cmd »:
cxload.c:523: error: `id' undeclared (first use in this function)
cxload.c:525: error: `adsl_handle' undeclared (first use in this function)
cxload.c:527: error: `answers' undeclared (first use in this function)
cxload.c: Hors de toute fonction :
cxload.c:532: error: erreur d'analyse syntaxique before '*' token
cxload.c:533: attention : function declaration isn't a prototype
cxload.c: Dans la fonction « send_cmd_wait »:
cxload.c:537: error: `id' undeclared (first use in this function)
cxload.c:538: error: `adsl_handle' undeclared (first use in this function)
cxload.c:538: error: `wait' undeclared (first use in this function)
cxload.c:538: error: `answers' undeclared (first use in this function)
cxload.c:538: error: `timeout' undeclared (first use in this function)
cxload.c: Hors de toute fonction :
cxload.c:542: error: erreur d'analyse syntaxique before '*' token
cxload.c:543: attention : function declaration isn't a prototype
cxload.c: Dans la fonction « send_cmd_value »:
cxload.c:547: error: `id' undeclared (first use in this function)
cxload.c:547: error: `value' undeclared (first use in this function)
cxload.c:549: error: `adsl_handle' undeclared (first use in this function)
cxload.c:551: error: `answers' undeclared (first use in this function)
cxload.c: Hors de toute fonction :
cxload.c:556: error: erreur d'analyse syntaxique before '*' token
cxload.c:557: attention : function declaration isn't a prototype
cxload.c: Dans la fonction « send_goto_cmd »:
cxload.c:561: error: `address' undeclared (first use in this function)
cxload.c:562: error: `adsl_handle' undeclared (first use in this function)
cxload.c: Hors de toute fonction :
cxload.c:589: error: erreur d'analyse syntaxique before '*' token
cxload.c:590: attention : function declaration isn't a prototype
cxload.c: Dans la fonction « send_configuration »:
cxload.c:593: error: `last' undeclared (first use in this function)
cxload.c:593: error: `first' undeclared (first use in this function)
cxload.c:623: error: `adsl_handle' undeclared (first use in this function)
cxload.c: Hors de toute fonction :
cxload.c:630: error: erreur d'analyse syntaxique before '*' token
cxload.c:630: attention : function declaration isn't a prototype
cxload.c: Dans la fonction « clear_endpoints »:
cxload.c:631: error: `adsl_handle' undeclared (first use in this function)
cxload.c: Hors de toute fonction :
cxload.c:644: error: erreur d'analyse syntaxique before '*' token
cxload.c:645: attention : function declaration isn't a prototype
cxload.c: Dans la fonction « send_block »:
cxload.c:646: error: `len' undeclared (first use in this function)
cxload.c:664: error: `bufin' undeclared (first use in this function)
cxload.c:670: error: `place' undeclared (first use in this function)
cxload.c:675: error: `adsl_handle' undeclared (first use in this function)
cxload.c: Hors de toute fonction :
cxload.c:684: error: erreur d'analyse syntaxique before '*' token
cxload.c:685: attention : function declaration isn't a prototype
cxload.c: Dans la fonction « load_firmware »:
cxload.c:696: error: `adsl_handle' undeclared (first use in this function)
cxload.c: Dans la fonction « init_modem »:
cxload.c:910: error: dereferencing pointer to incomplete type
cxload.c:911: error: dereferencing pointer to incomplete type
cxload.c: Dans la fonction « main »:
cxload.c:1149: error: `usb_dev_handle' undeclared (first use in this function)
cxload.c:1149: error: `adsl_handle' undeclared (first use in this function)
cxload.c:1197: attention : implicit declaration of function `usb_init'
cxload.c:1198: attention : implicit declaration of function `usb_find_busses'
cxload.c:1203: attention : implicit declaration of function `usb_find_devices'
cxload.c:1210: error: `usb_busses' undeclared (first use in this function)
cxload.c:1214: error: dereferencing pointer to incomplete type
cxload.c:1217: error: dereferencing pointer to incomplete type
cxload.c:1217: error: dereferencing pointer to incomplete type
cxload.c:1224: error: dereferencing pointer to incomplete type
cxload.c:1227: error: dereferencing pointer to incomplete type
cxload.c:1234: error: dereferencing pointer to incomplete type
cxload.c:1234: error: dereferencing pointer to incomplete type
cxload.c:1248: attention : implicit declaration of function `usb_open'
cxload.c:1255: attention : implicit declaration of function `usb_set_configuration'
cxload.c:1257: attention : l'argument de format n'est pas un pointeur (arg 2)
cxload.c:1261: attention : implicit declaration of function `usb_claim_interface'
cxload.c:1263: attention : l'argument de format n'est pas un pointeur (arg 2)
cxload.c:1272: attention : implicit declaration of function `usb_release_interface'
cxload.c:1274: attention : implicit declaration of function `usb_close'
make[1]: *** [cxload] Erreur 1
make[1]: quittant le répertoire « /usr/local/cxacru/init »
make: *** [CX_INIT] Erreur 2

@+ et merci d'avance !

Hors ligne

#2 Le 27/05/2005, à 21:35

manal

Re : Juste besoin de savoir si vous savez se que sa veux dire !

Bon beh désolé, mais il va falloir que tu fasses un petit apt-get... pas taper, pas taper. Mais la ligne suivante ne trompe pas :

../include/usbi.h:4:17: usb.h : Aucun fichier ou répertoire de ce type

Il te manque le paquet libusb-dev. Et pas de pot, il ne se trouve pas sur les cd, je viens de vérifier. Donc beh la solution : tu vas chez ton pote avec ta clé usb favorite et tu télécharges le paquets qu'il faut à partir de http://archive.ubuntu.com par exemple.

Fait gaffe aux dépendances, libusb-dev dépend de libc6-dev, qui dépend de linux-kernel-header. Tu as donc trois paquets a récupérer.

Bon courage

Manu =(o

Dernière modification par manal (Le 27/05/2005, à 21:35)


Libère ton esprit, et ton cul suivra

Hors ligne

#3 Le 27/05/2005, à 22:20

Vince1407

Re : Juste besoin de savoir si vous savez se que sa veux dire !

Ouais maintenant je peux meme pas installer il me met une erreur après que je me log avec gdm ! Donc pas possible d'installer ses trois fichiers !

Il me dis que .... attendez un reboot et je vous dis !

@d taleur !

EDIT : il me dis qu'il y a un probleme ou que j'ai plus de place ! Bon je vais faire UNE concession : je finis de télécharger Hoary je l'install sur 9.0Go ( enfin il en avais deja 6.0 Go ) et si sa marche pas il vire !

Bonne soirée !

Dernière modification par Vince1407 (Le 27/05/2005, à 22:35)

Hors ligne