Contenu | Rechercher | Menus

Annonce

Si vous rencontrez des soucis à rester connecté sur le forum (ou si vous avez perdu votre mot de passe) déconnectez-vous et reconnectez-vous depuis cette page, en cochant la case "Me connecter automatiquement lors de mes prochaines visites". Attention, le forum rencontre actuellement quelques difficultés. En cas d'erreur 502, il ne faut pas re-valider l'envoi d'un message ou l'ouverture d'une discussion, au risque de créer un doublon.

La section divers se réorganise ! De nouvelles sous-sections à venir. (plus d'infos + donner son avis)

#1 Le 31/10/2005, à 15:04

kingboxer

Impossible d'installer CVSCedega

Bon j'ai un problème lors de l'exécution de ce script sh WineCVS.sh

J'ai déja été voir sur deux tutos, dont celui-ci sur ce meme forum:

http://forum.ubuntu-fr.org/viewtopic.php?id=13199

mais cela n'a pas résolu mon problème

ce qui suit est l'erreur que j'ai dans ma console

merci pour votre aide

kingboxer

--------- Error log - file /root/.WineCVS/sources/cvscedega/ErrorLog : ---------convert.c:282: erreur: invalid lvalue in increment
convert.c:286: erreur: membre gauche de l'affectation invalide
convert.c:287: erreur: membre gauche de l'affectation invalide
convert.c:293: erreur: invalid lvalue in increment
convert.c:293: erreur: invalid lvalue in increment
convert.c:295: erreur: invalid lvalue in increment
convert.c:295: erreur: invalid lvalue in increment
convert.c:300: erreur: membre gauche de l'affectation invalide
convert.c:301: erreur: membre gauche de l'affectation invalide
convert.c:308: erreur: invalid lvalue in increment
convert.c:308: erreur: invalid lvalue in increment
convert.c:309: erreur: invalid lvalue in increment
convert.c:309: erreur: invalid lvalue in increment
convert.c:310: erreur: invalid lvalue in increment
convert.c:310: erreur: invalid lvalue in increment
convert.c:311: erreur: invalid lvalue in increment
convert.c:311: erreur: invalid lvalue in increment
convert.c:314: erreur: membre gauche de l'affectation invalide
convert.c:315: erreur: membre gauche de l'affectation invalide
convert.c:323: erreur: invalid lvalue in increment
convert.c:323: erreur: invalid lvalue in increment
convert.c: In function ‘GetMenu32Size16’:
convert.c:340: erreur: invalid lvalue in increment
convert.c:341: erreur: invalid lvalue in increment
convert.c:342: erreur: membre gauche de l'affectation invalide
convert.c:347: erreur: invalid lvalue in increment
convert.c:349: erreur: invalid lvalue in increment
convert.c:353: erreur: membre gauche de l'affectation invalide
convert.c:360: erreur: invalid lvalue in increment
convert.c:361: erreur: invalid lvalue in increment
convert.c:362: erreur: invalid lvalue in increment
convert.c:363: erreur: invalid lvalue in increment
convert.c:365: erreur: membre gauche de l'affectation invalide
convert.c:373: erreur: invalid lvalue in increment
convert.c: In function ‘ConvertAccelerator32To16’:
convert.c:394: erreur: invalid lvalue in increment
convert.c:394: erreur: invalid lvalue in increment
convert.c:396: erreur: invalid lvalue in increment
convert.c:398: erreur: invalid lvalue in increment
convert.c:398: erreur: invalid lvalue in increment
convert.c:399: erreur: invalid lvalue in increment
convert.c:399: erreur: invalid lvalue in increment
convert.c:401: erreur: invalid lvalue in increment
make[3]: *** [convert.o] Erreur 1
make[3]: quittant le répertoire « /root/.WineCVS/sources/cvscedega/winex/loader/ne »
make[2]: *** [../../loader/ne/ne.o] Erreur 2
make[2]: quittant le répertoire « /root/.WineCVS/sources/cvscedega/winex/dlls/ntdll »
make[1]: *** [ntdll/libntdll.so] Erreur 2
make[1]: quittant le répertoire « /root/.WineCVS/sources/cvscedega/winex/dlls »
make: *** [dlls] Erreur 2

Hors ligne

#2 Le 01/11/2005, à 02:44

kingboxer

Re : Impossible d'installer CVSCedega

Re-salut,

Je continues a chercher ici, mais je sèche assez fort

Hors ligne

Haut de page ↑