Contenu | Rechercher | Menus

Annonce

Si vous rencontrez des soucis à rester connecté sur le forum (ou si vous avez perdu votre mot de passe) déconnectez-vous et reconnectez-vous depuis cette page, en cochant la case "Me connecter automatiquement lors de mes prochaines visites".
Test de l'ISO d'Ubuntu francophone : nous avons besoin de testeurs pour la version francophone d'Ubuntu 14.04. Liens et informations ici.

Attention, une faille de sécurité dans bash a récemment été rapportée, il est recommandé de mettre à jour son système (plus de détails)

#1 Le 24/02/2008, à 15:16

quent197

erreur installation madwifi...

Salut à tous,
j'ai installé ubuntu 7.10 récemment et j'essaie désespérément d'installer les drivers madwifi pour ma carte D-link DWA-643 (express card) que j'ai préinstallé avec ndiswrapper avec le pilote windows net5416.inf.
mais voila que quand j'essaye de compiler madwifi un message d'erreur apparait, voici une copie de ce message:

creux@serialchick:~/Bureau/madwifi-0.9.4$ sudo make
[sudo] password for creux:
Checking requirements... ok.
Checking kernel configuration... ok.
make -C /lib/modules/2.6.22-14-generic/build SUBDIRS=/home/creux/Bureau/madwifi-0.9.4 modules
make[1]: Entering directory `/usr/src/linux-headers-2.6.22-14-generic'
  HOSTCC  /home/creux/Bureau/madwifi-0.9.4/ath_hal/uudecode
/home/creux/Bureau/madwifi-0.9.4/ath_hal/uudecode.c:26:19: error: stdio.h: No such file or directory
/home/creux/Bureau/madwifi-0.9.4/ath_hal/uudecode.c:27:19: error: errno.h: No such file or directory
/home/creux/Bureau/madwifi-0.9.4/ath_hal/uudecode.c:28:20: error: getopt.h: No such file or directory
/home/creux/Bureau/madwifi-0.9.4/ath_hal/uudecode.c:29:20: error: string.h: No such file or directory
/home/creux/Bureau/madwifi-0.9.4/ath_hal/uudecode.c:30:20: error: stdlib.h: No such file or directory
/home/creux/Bureau/madwifi-0.9.4/ath_hal/uudecode.c:32:23: error: sys/fcntl.h: No such file or directory
/home/creux/Bureau/madwifi-0.9.4/ath_hal/uudecode.c:33:22: error: sys/stat.h: No such file or directory
/home/creux/Bureau/madwifi-0.9.4/ath_hal/uudecode.c: In function 'uudecode_usage':
/home/creux/Bureau/madwifi-0.9.4/ath_hal/uudecode.c:37: warning: implicit declaration of function 'printf'
/home/creux/Bureau/madwifi-0.9.4/ath_hal/uudecode.c:37: warning: incompatible implicit declaration of built-in function 'printf'
/home/creux/Bureau/madwifi-0.9.4/ath_hal/uudecode.c: At top level:
/home/creux/Bureau/madwifi-0.9.4/ath_hal/uudecode.c:40: error: expected ')' before '*' token
/home/creux/Bureau/madwifi-0.9.4/ath_hal/uudecode.c:70: error: expected ')' before '*' token
/home/creux/Bureau/madwifi-0.9.4/ath_hal/uudecode.c: In function 'main':
/home/creux/Bureau/madwifi-0.9.4/ath_hal/uudecode.c:121: error: 'FILE' undeclared (first use in this function)
/home/creux/Bureau/madwifi-0.9.4/ath_hal/uudecode.c:121: error: (Each undeclared identifier is reported only once
/home/creux/Bureau/madwifi-0.9.4/ath_hal/uudecode.c:121: error: for each function it appears in.)
/home/creux/Bureau/madwifi-0.9.4/ath_hal/uudecode.c:121: error: 'src_stream' undeclared (first use in this function)
/home/creux/Bureau/madwifi-0.9.4/ath_hal/uudecode.c:122: error: 'dst_stream' undeclared (first use in this function)
/home/creux/Bureau/madwifi-0.9.4/ath_hal/uudecode.c:122: error: 'NULL' undeclared (first use in this function)
/home/creux/Bureau/madwifi-0.9.4/ath_hal/uudecode.c:130: warning: implicit declaration of function 'getopt'
/home/creux/Bureau/madwifi-0.9.4/ath_hal/uudecode.c:134: error: 'optarg' undeclared (first use in this function)
/home/creux/Bureau/madwifi-0.9.4/ath_hal/uudecode.c:138: warning: implicit declaration of function 'exit'
/home/creux/Bureau/madwifi-0.9.4/ath_hal/uudecode.c:138: warning: incompatible implicit declaration of built-in function 'exit'
/home/creux/Bureau/madwifi-0.9.4/ath_hal/uudecode.c:141: error: 'optind' undeclared (first use in this function)
/home/creux/Bureau/madwifi-0.9.4/ath_hal/uudecode.c:142: error: 'stdin' undeclared (first use in this function)
/home/creux/Bureau/madwifi-0.9.4/ath_hal/uudecode.c:144: warning: implicit declaration of function 'fopen'
/home/creux/Bureau/madwifi-0.9.4/ath_hal/uudecode.c:146: warning: implicit declaration of function 'fprintf'
/home/creux/Bureau/madwifi-0.9.4/ath_hal/uudecode.c:146: warning: incompatible implicit declaration of built-in function 'fprintf'
/home/creux/Bureau/madwifi-0.9.4/ath_hal/uudecode.c:146: error: 'stderr' undeclared (first use in this function)
/home/creux/Bureau/madwifi-0.9.4/ath_hal/uudecode.c:147: warning: implicit declaration of function 'strerror'
/home/creux/Bureau/madwifi-0.9.4/ath_hal/uudecode.c:147: error: 'errno' undeclared (first use in this function)
/home/creux/Bureau/madwifi-0.9.4/ath_hal/uudecode.c:147: warning: format '%s' expects type 'char *', but argument 4 has type 'int'
/home/creux/Bureau/madwifi-0.9.4/ath_hal/uudecode.c:148: warning: incompatible implicit declaration of built-in function 'exit'
/home/creux/Bureau/madwifi-0.9.4/ath_hal/uudecode.c:152: warning: incompatible implicit declaration of built-in function 'exit'
/home/creux/Bureau/madwifi-0.9.4/ath_hal/uudecode.c:156: warning: implicit declaration of function 'get_line_from_file'
/home/creux/Bureau/madwifi-0.9.4/ath_hal/uudecode.c:156: warning: assignment makes pointer from integer without a cast
/home/creux/Bureau/madwifi-0.9.4/ath_hal/uudecode.c:157: warning: implicit declaration of function 'strncmp'
/home/creux/Bureau/madwifi-0.9.4/ath_hal/uudecode.c:164: warning: incompatible implicit declaration of built-in function 'fprintf'
/home/creux/Bureau/madwifi-0.9.4/ath_hal/uudecode.c:165: warning: incompatible implicit declaration of built-in function 'exit'
/home/creux/Bureau/madwifi-0.9.4/ath_hal/uudecode.c:168: warning: implicit declaration of function 'strtoul'
/home/creux/Bureau/madwifi-0.9.4/ath_hal/uudecode.c:170: warning: implicit declaration of function 'strchr'
/home/creux/Bureau/madwifi-0.9.4/ath_hal/uudecode.c:170: warning: incompatible implicit declaration of built-in function 'strchr'
/home/creux/Bureau/madwifi-0.9.4/ath_hal/uudecode.c:172: warning: incompatible implicit declaration of built-in function 'fprintf'
/home/creux/Bureau/madwifi-0.9.4/ath_hal/uudecode.c:173: warning: incompatible implicit declaration of built-in function 'exit'
/home/creux/Bureau/madwifi-0.9.4/ath_hal/uudecode.c:178: warning: implicit declaration of function 'strcmp'
/home/creux/Bureau/madwifi-0.9.4/ath_hal/uudecode.c:179: error: 'stdout' undeclared (first use in this function)
/home/creux/Bureau/madwifi-0.9.4/ath_hal/uudecode.c:182: error: 'O_WRONLY' undeclared (first use in this function)
/home/creux/Bureau/madwifi-0.9.4/ath_hal/uudecode.c:182: error: 'O_CREAT' undeclared (first use in this function)
/home/creux/Bureau/madwifi-0.9.4/ath_hal/uudecode.c:182: error: 'O_TRUNC' undeclared (first use in this function)
/home/creux/Bureau/madwifi-0.9.4/ath_hal/uudecode.c:186: error: 'O_EXCL' undeclared (first use in this function)
/home/creux/Bureau/madwifi-0.9.4/ath_hal/uudecode.c:188: warning: implicit declaration of function 'open'
/home/creux/Bureau/madwifi-0.9.4/ath_hal/uudecode.c:189: error: 'S_IRWXU' undeclared (first use in this function)
/home/creux/Bureau/madwifi-0.9.4/ath_hal/uudecode.c:189: error: 'S_IRWXG' undeclared (first use in this function)
/home/creux/Bureau/madwifi-0.9.4/ath_hal/uudecode.c:189: error: 'S_IRWXO' undeclared (first use in this function)
/home/creux/Bureau/madwifi-0.9.4/ath_hal/uudecode.c:191: warning: implicit declaration of function 'fdopen'
/home/creux/Bureau/madwifi-0.9.4/ath_hal/uudecode.c:193: warning: incompatible implicit declaration of built-in function 'fprintf'
/home/creux/Bureau/madwifi-0.9.4/ath_hal/uudecode.c:194: warning: format '%s' expects type 'char *', but argument 4 has type 'int'
/home/creux/Bureau/madwifi-0.9.4/ath_hal/uudecode.c:195: warning: incompatible implicit declaration of built-in function 'exit'
/home/creux/Bureau/madwifi-0.9.4/ath_hal/uudecode.c:199: warning: implicit declaration of function 'read_stduu'
/home/creux/Bureau/madwifi-0.9.4/ath_hal/uudecode.c:201: warning: implicit declaration of function 'fclose'
make[3]: *** [/home/creux/Bureau/madwifi-0.9.4/ath_hal/uudecode] Error 1
make[2]: *** [/home/creux/Bureau/madwifi-0.9.4/ath_hal] Error 2
make[1]: *** [_module_/home/creux/Bureau/madwifi-0.9.4] Error 2
make[1]: Leaving directory `/usr/src/linux-headers-2.6.22-14-generic'
make: *** [modules] Erreur 2
creux@serialchick:~/Bureau/madwifi-0.9.4$

est-ce qu'il manque un module quelque chose??
Est-ce possible d'installer madwifi derriere ndiswrapper?
merci  d'avance pour votre aide.

Hors ligne

#2 Le 24/02/2008, à 15:20

slasher_fun

Re : erreur installation madwifi...

Toi, t'as pas installé le paquet build-essential smile

Hors ligne

Haut de page ↑