Contenu | Rechercher | Menus

Annonce

Ubuntu 16.04 LTS
Commandez vos DVD et clés USB Ubuntu-fr !

Pour en savoir un peu plus sur l'équipe du forum.

Si vous avez des soucis pour rester connecté, déconnectez-vous puis reconnectez-vous depuis ce lien en cochant la case
Me connecter automatiquement lors de mes prochaines visites.

#1 Le 11/09/2017, à 18:43

stephanie77500

clé wifi tl-wn722n v2 sur ubuntu 16.04.3 TLS non reconnu ?

Bonjour à toute la communauté ubuntu !

Heureuse d’être parmi vous et très contente d'avoir trouver votre site smile
je suis nouvelle dans les tests de pénétration ubuntu et j'aurais besoin de votre aide s'il vous plait,
je bloque au niveau de ma clé wifi la voici http://www.tp-link.com/us/download/TL-WN722N.html,elle n'est pas reconnu par ubuntu ni kali linux
je passe par virtual box dernier version Oracle VM VirtualBox Version 5.1.26 r117224 (Qt5.6.2) https://www.virtualbox.org/wiki/Downloads
ma carte réseaux et une realtek RTL8723BS Wireless LAN 802.11n SDIO Network Adapter mon processeur Intel (R) Atom(TM) CPU Z335F 1.33GHz mémoire 2,00 Go systéme d'exploitation 32 bits processeur X64 sur windows 10.mon ubuntu 16.04.3 TLS i386 en 32 bits,j'ai essayé divers procédure mais pas de résultat  voici les commandes effectué a l'identique depuis le site ou il s'explique l'installation :

https://translate.googleusercontent.com … WY2ZVE81sQ

je précise que la clé fonctionne sous windows 10 mais lors de du branchement sous ubuntu elle se désactive,ma manips ce présente comme ceci,je branche ma clé sur virtual box puis je vais sur configuration de virtual box et ajoute la clé dans la rubrique usb elle apparaît bien et reconnu a ce moment là,lors du redémarrage elle se désactive et lors des tests sur le terminal de commande aucune trace de ma clé alors comme sur le site plus haut il précise que cela pourrait provenir d'une incompatibilité mais qui peut être remédier en ajouter une commande que je n'arrive pas a effecteur la voici  3 éme etape $ git clone https://github.com/lwfinger/rtl8188eu.git d’après le retour de commande il n'arrive pas a ajouter d'autre paquet ?

le programme git n'est pas encore installé.vous pouvez l'installé en tapant: sudo apt install git

ubuntu@ubuntu :~/tmp$  sudo apt install git
lecture des listes de paquets... fait
construction de l'arbre des dépendances
lecture des informations d'etat... fait
the following additional packages will be installed:
git-man liberror-perl
paquet suggéres :	
git-daemon-run | git-deamon-sysvinit git-doc git el
etc..........
les nouveaux paquets seront installés:
git git-man liberror-perl
0 mis a jour,3 nouvellement installé,0 a enlever et 0 non mis a jour.
il est necessaire de prendre 3958 ko dans les archives.
apres cette operation;28 mo d'espace disque supplémentaire seront utilisés.
souhaitez vous continuer ? O/N   o
E: impossible de recuperé [url]http://archive.Ubuntu.com/ubuntu/pool/main/g/git/git-man_2.7.4-oubuntu1.1_all.deb[/url] 404 not found 
( IP : 91.189.000.000.20
E: impossible de recuperer certaine archive,peut etre devrez vous lancer apt-get update ou essayer avec-- fix-missing ?

ubuntu@ubuntu :~/tmp$ apt-get update
lecture des paquets  ......fait
W:chmod 0700 of directory /var/lib/apt/list/partial failed - setup aptp partial directory (1 operation non permise)
E: impossible d ouvrir le fichier verrou/var/lib/apt/list/lock - open (13: permission non accordée)
etc...........

4éme etape

ubuntu@ubuntu :~/tmp$ cd rtl8188eu
bash ou cd rtl8188eu aucun fichier ou dossier

Apparament il n'arrive pas a installé les paquet restants pour la mise a jour et il ne trouve pas mon fichier Cd rtl8188eu préalablement télecharger ?
une aide svp je rame depuis une quizaine de jours merciiiiii


Modération : merci à l'avenir d'utiliser les balises code (explications ici).

Dernière modification par cqfd93 (Le 11/09/2017, à 18:53)

Hors ligne

#2 Le 11/09/2017, à 18:50

xubu1957

Re : clé wifi tl-wn722n v2 sur ubuntu 16.04.3 TLS non reconnu ?

Bonjour,

Pour ajouter toi-même les balises code à ton précédent message (Merci à cqfd93 wink )

  • Cliquer sur  le lien « Modifier » en bas à droite du message

  • Sélectionner le texte

  • Cliquer sur le <> de l'éditeur de message

1504631983.png


Il faudrait donner tes infos : Configuration wifi, en te servant du : Retour utilisable de commande

Avec la possibilité d'utiliser le : wificheck
Nota : un fichier wificheck.log est créé dans votre répertoire personnel, collez l'intégralité de son contenu dans votre discussion.

cqfd93 a écrit :

Astuce pour copier / coller sans erreur :

  • triple clic gauche pour sélectionner et copier une ligne entière

  • clic molette pour coller dans le terminal

Dernière modification par xubu1957 (Le 11/09/2017, à 18:55)


Important : Pensez à passer vos sujets en [Résolu] lorsque ceux-ci le sont, au début du titre en cliquant sur Modifier sous le premier message, et un bref récapitulatif de la solution à la fin de celui-ci. Merci.

Xubuntu 16.04.1 LTS : Lenovo T410 - Aspire 9411ASWI - HP 7100 DC - Asus 1015BX -Fujitsu Siemens Scaleo J3000  Membre de : Linux-Azur

Hors ligne

#3 Le 12/09/2017, à 00:11

cqfd93

Re : clé wifi tl-wn722n v2 sur ubuntu 16.04.3 TLS non reconnu ?

Modération

Bonjour,

Merci de modifier le  message précédent pour mettre les retours de commandes sous forme de texte entre balises code au lieu d'images qui alourdissent la navigation. Tout le monde n'a pas une connexion internet rapide…

Dernière modification par cqfd93 (Le 12/09/2017, à 18:24)

En ligne

#4 Le 12/09/2017, à 06:32

xubu1957

Re : clé wifi tl-wn722n v2 sur ubuntu 16.04.3 TLS non reconnu ?

Bonjour,

Nota : un fichier wificheck.log est créé dans votre répertoire personnel, collez l'intégralité de son contenu dans votre discussion.

Faut chercher le fichier dans ton ordi, et faire un copier/coller dans les crochets <> de l'éditeur de message.


Important : Pensez à passer vos sujets en [Résolu] lorsque ceux-ci le sont, au début du titre en cliquant sur Modifier sous le premier message, et un bref récapitulatif de la solution à la fin de celui-ci. Merci.

Xubuntu 16.04.1 LTS : Lenovo T410 - Aspire 9411ASWI - HP 7100 DC - Asus 1015BX -Fujitsu Siemens Scaleo J3000  Membre de : Linux-Azur

Hors ligne

#5 Le 12/09/2017, à 11:21

stephanie77500

Re : clé wifi tl-wn722n v2 sur ubuntu 16.04.3 TLS non reconnu ?

bonjour,

désoler pour le post précedent,voici le wificheck



>>    cat /etc/lsb-release 

DISTRIB_ID=Ubuntu
DISTRIB_RELEASE=16.04
DISTRIB_CODENAME=xenial
DISTRIB_DESCRIPTION="Ubuntu 16.04.3 LTS"

>>    lsusb 

Bus 001 Device 001: ID 1d6b:0002 Linux Foundation 2.0 root hub
Bus 002 Device 002: ID 80ee:0021 VirtualBox USB Tablet
Bus 002 Device 001: ID 1d6b:0001 Linux Foundation 1.1 root hub

>>    lspci -k -nn | grep -A 3 -i net 

00:03.0 Ethernet controller [0200]: Intel Corporation 82540EM Gigabit Ethernet Controller [8086:100e] (rev 02)
	Subsystem: Intel Corporation PRO/1000 MT Desktop Adapter [8086:001e]
	Kernel driver in use: e1000
	Kernel modules: e1000

>>    sudo lshw -C network 

  *-network
       description: Ethernet interface
       produit: 82540EM Gigabit Ethernet Controller
       fabriquant: Intel Corporation
       identifiant matériel: 3
       information bus: pci@0000:00:03.0
       nom logique: enp0s3
       version: 02
       numéro de série: 08:00:27:13:41:ee
       taille: 1Gbit/s
       capacité: 1Gbit/s
       bits: 32 bits
       horloge: 66MHz
       fonctionnalités: pm pcix bus_master cap_list ethernet physical tp 10bt 10bt-fd 100bt 100bt-fd 1000bt-fd autonegotiation
       configuration: autonegotiation=on broadcast=yes driver=e1000 driverversion=7.3.21-k8-NAPI duplex=full ip=10.0.2.15 latency=64 link=yes mingnt=255 multicast=yes port=twisted pair speed=1Gbit/s
       ressources: irq:10 mémoire:f0000000-f001ffff portE/S:d010(taille=8)

>>    lsmod 

Module                  Size  Used by
snd_intel8x0           36864  2
snd_ac97_codec        106496  1 snd_intel8x0
ac97_bus               16384  1 snd_ac97_codec
snd_pcm                94208  2 snd_ac97_codec,snd_intel8x0
intel_soc_dts_iosf     16384  0
intel_powerclamp       16384  0
punit_atom_debug       16384  0
snd_seq_midi           16384  0
crc32_pclmul           16384  0
pcbc                   16384  0
snd_seq_midi_event     16384  1 snd_seq_midi
vboxvideo              45056  2
aesni_intel            20480  0
aes_i586               20480  1 aesni_intel
ttm                    90112  1 vboxvideo
snd_rawmidi            28672  1 snd_seq_midi
crypto_simd            16384  1 aesni_intel
cryptd                 24576  1 crypto_simd
drm_kms_helper        139264  1 vboxvideo
snd_seq                57344  2 snd_seq_midi_event,snd_seq_midi
joydev                 20480  0
drm                   303104  5 vboxvideo,ttm,drm_kms_helper
snd_seq_device         16384  3 snd_seq,snd_rawmidi,snd_seq_midi
snd_timer              28672  2 snd_seq,snd_pcm
input_leds             16384  0
serio_raw              16384  0
snd                    65536  11 snd_seq,snd_ac97_codec,snd_timer,snd_rawmidi,snd_intel8x0,snd_seq_device,snd_pcm
fb_sys_fops            16384  1 drm_kms_helper
syscopyarea            16384  2 vboxvideo,drm_kms_helper
vboxguest             237568  1 vboxvideo
soundcore              16384  1 snd
i2c_piix4              20480  0
sysfillrect            16384  2 vboxvideo,drm_kms_helper
sysimgblt              16384  2 vboxvideo,drm_kms_helper
mac_hid                16384  0
parport_pc             32768  0
ppdev                  20480  0
lp                     20480  0
parport                45056  3 lp,parport_pc,ppdev
autofs4                40960  2
aufs                  212992  5595
nls_utf8               16384  1
isofs                  40960  1
dm_mirror              24576  0
dm_region_hash         20480  1 dm_mirror
dm_log                 20480  2 dm_mirror,dm_region_hash
hid_generic            16384  0
usbhid                 49152  0
hid                    98304  2 hid_generic,usbhid
psmouse               122880  0
ahci                   36864  0
e1000                 126976  0
libahci                32768  1 ahci
pata_acpi              16384  0
video                  40960  0
fjes                   61440  0
>>    iwconfig 


>>    ifconfig -a 

enp0s3    Link encap:Ethernet  HWaddr 08:00:27:13:41:ee  
          inet adr:10.0.2.15  Bcast:10.0.2.255  Masque:255.255.255.0
          adr inet6: fe80::6801:f080:e0fb:3c8c/64 Scope:Lien
          UP BROADCAST RUNNING MULTICAST  MTU:1500  Metric:1
          Packets reçus:10268 erreurs:0 :0 overruns:0 frame:0
          TX packets:6050 errors:0 dropped:0 overruns:0 carrier:0
          collisions:0 lg file transmission:1000 
          Octets reçus:7070517 (7.0 MB) Octets transmis:579658 (579.6 KB)

lo        Link encap:Boucle locale  
          inet adr:127.0.0.1  Masque:255.0.0.0
          adr inet6: ::1/128 Scope:Hôte
          UP LOOPBACK RUNNING  MTU:65536  Metric:1
          Packets reçus:760 erreurs:0 :0 overruns:0 frame:0
          TX packets:760 errors:0 dropped:0 overruns:0 carrier:0
          collisions:0 lg file transmission:1000 
          Octets reçus:75462 (75.4 KB) Octets transmis:75462 (75.4 KB)


>>    sudo iwlist scan 


>>    uname -r -m 

4.10.0-28-generic i686

>>    cat /etc/network/interfaces 

# interfaces(5) file used by ifup(8) and ifdown(8)
auto lo
iface lo inet loopback

>>    nm-tool 


>>    nmcli dev wifi 


>>    nmcli connection show 

NOM                 UUID                                  TYPE            PÉRIPHÉRIQUE 
Wired connection 1  8ba8afbf-a15c-30b9-8eff-37a95442e657  802-3-ethernet  enp0s3       

>>    sudo rfkill list 

Hors ligne

#6 Le 12/09/2017, à 15:26

xubu1957

Re : clé wifi tl-wn722n v2 sur ubuntu 16.04.3 TLS non reconnu ?

Tu n'avais pas branché la clé sur un port USB ?

Rajout : Tu avais vu cette discussion > [WiFi] Script pour Clé WiFi RTL8188EU ?

Rajout +1 :
Pourras tu tester :

sudo modprobe -v rtl8188eu

?

Dernière modification par xubu1957 (Le 12/09/2017, à 19:06)


Important : Pensez à passer vos sujets en [Résolu] lorsque ceux-ci le sont, au début du titre en cliquant sur Modifier sous le premier message, et un bref récapitulatif de la solution à la fin de celui-ci. Merci.

Xubuntu 16.04.1 LTS : Lenovo T410 - Aspire 9411ASWI - HP 7100 DC - Asus 1015BX -Fujitsu Siemens Scaleo J3000  Membre de : Linux-Azur

Hors ligne

#7 Le 13/09/2017, à 00:33

stephanie77500

Re : clé wifi tl-wn722n v2 sur ubuntu 16.04.3 TLS non reconnu ?

bonsoir xubu,

le rendu c'est la meme que sur la procédure expliquer plus haut les paquet ne s'installe pas en entier ?

ubuntu@ubuntu:~$ mkdir ~/RTL8188EU
ubuntu@ubuntu:~$ cd ~/RTL8188EU
ubuntu@ubuntu:~/RTL8188EU$ git clone git://github.com/lwfinger/rtl8188eu
Le programme « git » n'est pas encore installé. Vous pouvez l'installer en tapant :
sudo apt install git
ubuntu@ubuntu:~/RTL8188EU$ sudo apt install git
Lecture des listes de paquets... Fait
Construction de l'arbre des dépendances       
Lecture des informations d'état... Fait
The following additional packages will be installed:
  git-man liberror-perl
Paquets suggérés :
  git-daemon-run | git-daemon-sysvinit git-doc git-el git-email git-gui gitk
  gitweb git-arch git-cvs git-mediawiki git-svn
Les NOUVEAUX paquets suivants seront installés :
  git git-man liberror-perl
0 mis à jour, 3 nouvellement installés, 0 à enlever et 0 non mis à jour.
Il est nécessaire de prendre 3 958 ko dans les archives.
Après cette opération, 28,1 Mo d'espace disque supplémentaires seront utilisés.
Souhaitez-vous continuer ? [O/n] o
Réception de:1 http://archive.ubuntu.com/ubuntu xenial/main i386 liberror-perl all 0.17-1.2 [19,6 kB]
Err:2 http://archive.ubuntu.com/ubuntu xenial-updates/main i386 git-man all 1:2.7.4-0ubuntu1.1
  404  Not Found [IP : 91.189.91.26 80]
Err:2 http://archive.ubuntu.com/ubuntu xenial-updates/main i386 git-man all 1:2.7.4-0ubuntu1.1
  404  Not Found [IP : 91.189.91.26 80]
Err:3 http://archive.ubuntu.com/ubuntu xenial-updates/main i386 git i386 1:2.7.4-0ubuntu1.1
  404  Not Found [IP : 91.189.91.26 80]
Err:3 http://archive.ubuntu.com/ubuntu xenial-updates/main i386 git i386 1:2.7.4-0ubuntu1.1
  404  Not Found [IP : 91.189.91.26 80]
19,6 ko réceptionnés en 0s (20,0 ko/s)
E: Impossible de récupérer http://archive.ubuntu.com/ubuntu/pool/main/g/git/git-man_2.7.4-0ubuntu1.1_all.deb  404  Not Found [IP : 91.189.91.26 80]

E: Impossib

le wificheck avec la clé branché

>>    cat /etc/lsb-release 

DISTRIB_ID=Ubuntu
DISTRIB_RELEASE=16.04
DISTRIB_CODENAME=xenial
DISTRIB_DESCRIPTION="Ubuntu 16.04.3 LTS"

>>    lsusb 

Bus 001 Device 002: ID 2357:010c  
Bus 001 Device 001: ID 1d6b:0002 Linux Foundation 2.0 root hub
Bus 002 Device 002: ID 80ee:0021 VirtualBox USB Tablet
Bus 002 Device 001: ID 1d6b:0001 Linux Foundation 1.1 root hub

>>    lspci -k -nn | grep -A 3 -i net 

00:03.0 Ethernet controller [0200]: Intel Corporation 82540EM Gigabit Ethernet Controller [8086:100e] (rev 02)
	Subsystem: Intel Corporation PRO/1000 MT Desktop Adapter [8086:001e]
	Kernel driver in use: e1000
	Kernel modules: e1000

>>    sudo lshw -C network 

  *-network
       description: Ethernet interface
       produit: 82540EM Gigabit Ethernet Controller
       fabriquant: Intel Corporation
       identifiant matériel: 3
       information bus: pci@0000:00:03.0
       nom logique: enp0s3
       version: 02
       numéro de série: 08:00:27:13:41:ee
       taille: 1Gbit/s
       capacité: 1Gbit/s
       bits: 32 bits
       horloge: 66MHz
       fonctionnalités: pm pcix bus_master cap_list ethernet physical tp 10bt 10bt-fd 100bt 100bt-fd 1000bt-fd autonegotiation
       configuration: autonegotiation=on broadcast=yes driver=e1000 driverversion=7.3.21-k8-NAPI duplex=full ip=10.0.2.15 latency=64 link=yes mingnt=255 multicast=yes port=twisted pair speed=1Gbit/s
       ressources: irq:10 mémoire:f0000000-f001ffff portE/S:d010(taille=8)

>>    lsmod 

Module                  Size  Used by
snd_intel8x0           36864  2
snd_ac97_codec        106496  1 snd_intel8x0
ac97_bus               16384  1 snd_ac97_codec
intel_soc_dts_iosf     16384  0
snd_pcm                94208  2 snd_ac97_codec,snd_intel8x0
intel_powerclamp       16384  0
punit_atom_debug       16384  0
snd_seq_midi           16384  0
crc32_pclmul           16384  0
pcbc                   16384  0
snd_seq_midi_event     16384  1 snd_seq_midi
vboxvideo              45056  2
aesni_intel            20480  0
snd_rawmidi            28672  1 snd_seq_midi
aes_i586               20480  1 aesni_intel
ttm                    90112  1 vboxvideo
crypto_simd            16384  1 aesni_intel
cryptd                 24576  1 crypto_simd
drm_kms_helper        139264  1 vboxvideo
snd_seq                57344  2 snd_seq_midi_event,snd_seq_midi
joydev                 20480  0
snd_seq_device         16384  3 snd_seq,snd_rawmidi,snd_seq_midi
drm                   303104  5 vboxvideo,ttm,drm_kms_helper
snd_timer              28672  2 snd_seq,snd_pcm
input_leds             16384  0
snd                    65536  11 snd_seq,snd_ac97_codec,snd_timer,snd_rawmidi,snd_intel8x0,snd_seq_device,snd_pcm
serio_raw              16384  0
fb_sys_fops            16384  1 drm_kms_helper
syscopyarea            16384  2 vboxvideo,drm_kms_helper
vboxguest             237568  1 vboxvideo
sysfillrect            16384  2 vboxvideo,drm_kms_helper
soundcore              16384  1 snd
i2c_piix4              20480  0
sysimgblt              16384  2 vboxvideo,drm_kms_helper
mac_hid                16384  0
parport_pc             32768  0
ppdev                  20480  0
lp                     20480  0
parport                45056  3 lp,parport_pc,ppdev
autofs4                40960  2
aufs                  212992  5513
nls_utf8               16384  1
isofs                  40960  1
dm_mirror              24576  0
dm_region_hash         20480  1 dm_mirror
dm_log                 20480  2 dm_mirror,dm_region_hash
hid_generic            16384  0
usbhid                 49152  0
hid                    98304  2 hid_generic,usbhid
psmouse               122880  0
ahci                   36864  0
libahci                32768  1 ahci
e1000                 126976  0
fjes                   61440  0
pata_acpi              16384  0
video                  40960  0
>>    iwconfig 


>>    ifconfig -a 

enp0s3    Link encap:Ethernet  HWaddr 08:00:27:13:41:ee  
          inet adr:10.0.2.15  Bcast:10.0.2.255  Masque:255.255.255.0
          adr inet6: fe80::c821:e4a9:c1f4:60a9/64 Scope:Lien
          UP BROADCAST RUNNING MULTICAST  MTU:1500  Metric:1
          Packets reçus:13805 erreurs:0 :0 overruns:0 frame:0
          TX packets:8706 errors:0 dropped:0 overruns:0 carrier:0
          collisions:0 lg file transmission:1000 
          Octets reçus:8643658 (8.6 MB) Octets transmis:865781 (865.7 KB)

lo        Link encap:Boucle locale  
          inet adr:127.0.0.1  Masque:255.0.0.0
          adr inet6: ::1/128 Scope:Hôte
          UP LOOPBACK RUNNING  MTU:65536  Metric:1
          Packets reçus:932 erreurs:0 :0 overruns:0 frame:0
          TX packets:932 errors:0 dropped:0 overruns:0 carrier:0
          collisions:0 lg file transmission:1000 
          Octets reçus:98369 (98.3 KB) Octets transmis:98369 (98.3 KB)


>>    sudo iwlist scan 


>>    uname -r -m 

4.10.0-28-generic i686

>>    cat /etc/network/interfaces 

# interfaces(5) file used by ifup(8) and ifdown(8)
auto lo
iface lo inet loopback

>>    nm-tool 


>>    nmcli dev wifi 


>>    nmcli connection show 

NOM                 UUID                                  TYPE            PÉRIPHÉRIQUE 
Wired connection 1  c6cd3939-aa40-38e2-ac64-b4226b10e64a  802-3-ethernet  enp0s3       

>>    sudo rfkill list 

Dernière modification par stephanie77500 (Le 13/09/2017, à 01:30)

Hors ligne

#8 Le 13/09/2017, à 02:01

stephanie77500

Re : clé wifi tl-wn722n v2 sur ubuntu 16.04.3 TLS non reconnu ?

Apparament j'aurais des soucis a télecharger des paquets,je suis donc aller les cherché sur le site de la clé et télécharger le driver puis enregistré dans mon pc depuis ubuntu et effectuer c'est modeste commande que je connais :


ubuntu@ubuntu:~$ ls
Desktop    Modèles  RTL8188EU                                 Vidéos
Documents  Musique  rtl8188EUS_linux_v4.3.0.8_13968.20150417  wificheck
Images     Public   Téléchargements                           wificheck.log
ubuntu@ubuntu:~$ rtl8188EUS_linux_v4.3.0.8_13968.20150417
rtl8188EUS_linux_v4.3.0.8_13968.20150417 : commande introuvable
ubuntu@ubuntu:~$ ls rtl8188EUS_linux_v4.3.0.8_13968.20150417
clean  hal          include  Makefile  platform  wlan0dhcp
core   ifcfg-wlan0  Kconfig  os_dep    runwpa    wpa_0_8.conf
ubuntu@ubuntu:~$ cd rtl8188EUS_linux_v4.3.0.8_13968.20150417
ubuntu@ubuntu:~/rtl8188EUS_linux_v4.3.0.8_13968.20150417$ sudo apt install
Lecture des listes de paquets... Fait
Construction de l'arbre des dépendances       
Lecture des informations d'état... Fait
0 mis à jour, 0 nouvellement installés, 0 à enlever et 0 non mis à jour.
ubuntu@ubuntu:~/rtl8188EUS_linux_v4.3.0.8_13968.20150417$ sudo make all
"******************************************"
"NO SKRC,we will use default KSRC"
"******************************************"
make ARCH=i386 CROSS_COMPILE= -C /lib/modules/4.10.0-28-generic/build M=/home/ubuntu/rtl8188EUS_linux_v4.3.0.8_13968.20150417  modules
make[1] : on entre dans le répertoire « /usr/src/linux-headers-4.10.0-28-generic »
"******************************************"
"NO SKRC,we will use default KSRC"
"******************************************"
  CC [M]  /home/ubuntu/rtl8188EUS_linux_v4.3.0.8_13968.20150417/core/rtw_cmd.o
  CC [M]  /home/ubuntu/rtl8188EUS_linux_v4.3.0.8_13968.20150417/core/rtw_security.o
  CC [M]  /home/ubuntu/rtl8188EUS_linux_v4.3.0.8_13968.20150417/core/rtw_debug.o
In file included from /home/ubuntu/rtl8188EUS_linux_v4.3.0.8_13968.20150417/include/drv_types.h:64:0,
                 from /home/ubuntu/rtl8188EUS_linux_v4.3.0.8_13968.20150417/core/rtw_debug.c:22:
/home/ubuntu/rtl8188EUS_linux_v4.3.0.8_13968.20150417/core/rtw_debug.c: In function ‘dump_drv_version’:
/home/ubuntu/rtl8188EUS_linux_v4.3.0.8_13968.20150417/include/rtw_debug.h:187:19: error: void value not ignored as it ought to be
  #define _seqdump seq_printf
                   ^
/home/ubuntu/rtl8188EUS_linux_v4.3.0.8_13968.20150417/include/rtw_debug.h:240:7: note: in expansion of macro ‘_seqdump’
    if(_seqdump(sel, fmt, ##arg)) /*rtw_warn_on(1)*/; \
       ^
/home/ubuntu/rtl8188EUS_linux_v4.3.0.8_13968.20150417/core/rtw_debug.c:65:2: note: in expansion of macro ‘DBG_871X_SEL_NL’
  DBG_871X_SEL_NL(sel, "%s %s\n", DRV_NAME, DRIVERVERSION);
  ^
/home/ubuntu/rtl8188EUS_linux_v4.3.0.8_13968.20150417/core/rtw_debug.c:66:64: error: macro "__DATE__" might prevent reproducible builds [-Werror=date-time]
  DBG_871X_SEL_NL(sel, "build time: %s %s\n", __DATE__, __TIME__);
                                                                ^
/home/ubuntu/rtl8188EUS_linux_v4.3.0.8_13968.20150417/core/rtw_debug.c:66:64: error: macro "__TIME__" might prevent reproducible builds [-Werror=date-time]
/home/ubuntu/rtl8188EUS_linux_v4.3.0.8_13968.20150417/core/rtw_debug.c:66:64: error: macro "__DATE__" might prevent reproducible builds [-Werror=date-time]
/home/ubuntu/rtl8188EUS_linux_v4.3.0.8_13968.20150417/core/rtw_debug.c:66:64: error: macro "__TIME__" might prevent reproducible builds [-Werror=date-time]
/home/ubuntu/rtl8188EUS_linux_v4.3.0.8_13968.20150417/core/rtw_debug.c:66:64: error: macro "__DATE__" might prevent reproducible builds [-Werror=date-time]
/home/ubuntu/rtl8188EUS_linux_v4.3.0.8_13968.20150417/core/rtw_debug.c:66:64: error: macro "__TIME__" might prevent reproducible builds [-Werror=date-time]
In file included from /home/ubuntu/rtl8188EUS_linux_v4.3.0.8_13968.20150417/include/drv_types.h:64:0,
                 from /home/ubuntu/rtl8188EUS_linux_v4.3.0.8_13968.20150417/core/rtw_debug.c:22:
/home/ubuntu/rtl8188EUS_linux_v4.3.0.8_13968.20150417/include/rtw_debug.h:187:19: error: void value not ignored as it ought to be
  #define _seqdump seq_printf
                   ^
/home/ubuntu/rtl8188EUS_linux_v4.3.0.8_13968.20150417/include/rtw_debug.h:240:7: note: in expansion of macro ‘_seqdump’
    if(_seqdump(sel, fmt, ##arg)) /*rtw_warn_on(1)*/; \
       ^
/home/ubuntu/rtl8188EUS_linux_v4.3.0.8_13968.20150417/core/rtw_debug.c:66:2: note: in expansion of macro ‘DBG_871X_SEL_NL’
  DBG_871X_SEL_NL(sel, "build time: %s %s\n", __DATE__, __TIME__);
  ^
/home/ubuntu/rtl8188EUS_linux_v4.3.0.8_13968.20150417/core/rtw_debug.c: In function ‘dump_log_level’:
/home/ubuntu/rtl8188EUS_linux_v4.3.0.8_13968.20150417/include/rtw_debug.h:187:19: error: void value not ignored as it ought to be
  #define _seqdump seq_printf
                   ^
/home/ubuntu/rtl8188EUS_linux_v4.3.0.8_13968.20150417/include/rtw_debug.h:240:7: note: in expansion of macro ‘_seqdump’
    if(_seqdump(sel, fmt, ##arg)) /*rtw_warn_on(1)*/; \
       ^
/home/ubuntu/rtl8188EUS_linux_v4.3.0.8_13968.20150417/core/rtw_debug.c:71:2: note: in expansion of macro ‘DBG_871X_SEL_NL’
  DBG_871X_SEL_NL(sel, "log_level:%d\n", GlobalDebugLevel);
  ^
/home/ubuntu/rtl8188EUS_linux_v4.3.0.8_13968.20150417/core/rtw_debug.c: In function ‘mac_reg_dump’:
/home/ubuntu/rtl8188EUS_linux_v4.3.0.8_13968.20150417/include/rtw_debug.h:187:19: error: void value not ignored as it ought to be
  #define _seqdump seq_printf
                   ^
/home/ubuntu/rtl8188EUS_linux_v4.3.0.8_13968.20150417/include/rtw_debug.h:240:7: note: in expansion of macro ‘_seqdump’
    if(_seqdump(sel, fmt, ##arg)) /*rtw_warn_on(1)*/; \
       ^
/home/ubuntu/rtl8188EUS_linux_v4.3.0.8_13968.20150417/core/rtw_debug.c:98:2: note: in expansion of macro ‘DBG_871X_SEL_NL’
  DBG_871X_SEL_NL(sel, "======= MAC REG =======\n");
  ^
/home/ubuntu/rtl8188EUS_linux_v4.3.0.8_13968.20150417/include/rtw_debug.h:187:19: error: void value not ignored as it ought to be
  #define _seqdump seq_printf
                   ^
/home/ubuntu/rtl8188EUS_linux_v4.3.0.8_13968.20150417/include/rtw_debug.h:240:7: note: in expansion of macro ‘_seqdump’
    if(_seqdump(sel, fmt, ##arg)) /*rtw_warn_on(1)*/; \
       ^
/home/ubuntu/rtl8188EUS_linux_v4.3.0.8_13968.20150417/core/rtw_debug.c:103:4: note: in expansion of macro ‘DBG_871X_SEL_NL’
    DBG_871X_SEL_NL(sel, "0x%03x",i);
    ^
/home/ubuntu/rtl8188EUS_linux_v4.3.0.8_13968.20150417/include/rtw_debug.h:187:19: error: void value not ignored as it ought to be
  #define _seqdump seq_printf
                   ^
/home/ubuntu/rtl8188EUS_linux_v4.3.0.8_13968.20150417/include/rtw_debug.h:230:7: note: in expansion of macro ‘_seqdump’
    if(_seqdump(sel, fmt, ##arg)) /*rtw_warn_on(1)*/; \
       ^
/home/ubuntu/rtl8188EUS_linux_v4.3.0.8_13968.20150417/core/rtw_debug.c:104:3: note: in expansion of macro ‘DBG_871X_SEL’
   DBG_871X_SEL(sel, " 0x%08x ", rtw_read32(adapter,i));
   ^
/home/ubuntu/rtl8188EUS_linux_v4.3.0.8_13968.20150417/include/rtw_debug.h:187:19: error: void value not ignored as it ought to be
  #define _seqdump seq_printf
                   ^
/home/ubuntu/rtl8188EUS_linux_v4.3.0.8_13968.20150417/include/rtw_debug.h:230:7: note: in expansion of macro ‘_seqdump’
    if(_seqdump(sel, fmt, ##arg)) /*rtw_warn_on(1)*/; \
       ^
/home/ubuntu/rtl8188EUS_linux_v4.3.0.8_13968.20150417/core/rtw_debug.c:106:4: note: in expansion of macro ‘DBG_871X_SEL’
    DBG_871X_SEL(sel, "\n");
    ^
/home/ubuntu/rtl8188EUS_linux_v4.3.0.8_13968.20150417/core/rtw_debug.c: In function ‘bb_reg_dump’:
/home/ubuntu/rtl8188EUS_linux_v4.3.0.8_13968.20150417/include/rtw_debug.h:187:19: error: void value not ignored as it ought to be
  #define _seqdump seq_printf
                   ^
/home/ubuntu/rtl8188EUS_linux_v4.3.0.8_13968.20150417/include/rtw_debug.h:240:7: note: in expansion of macro ‘_seqdump’
    if(_seqdump(sel, fmt, ##arg)) /*rtw_warn_on(1)*/; \
       ^
/home/ubuntu/rtl8188EUS_linux_v4.3.0.8_13968.20150417/core/rtw_debug.c:114:2: note: in expansion of macro ‘DBG_871X_SEL_NL’
  DBG_871X_SEL_NL(sel, "======= BB REG =======\n");
  ^
/home/ubuntu/rtl8188EUS_linux_v4.3.0.8_13968.20150417/include/rtw_debug.h:187:19: error: void value not ignored as it ought to be
  #define _seqdump seq_printf
                   ^
/home/ubuntu/rtl8188EUS_linux_v4.3.0.8_13968.20150417/include/rtw_debug.h:240:7: note: in expansion of macro ‘_seqdump’
    if(_seqdump(sel, fmt, ##arg)) /*rtw_warn_on(1)*/; \
       ^
/home/ubuntu/rtl8188EUS_linux_v4.3.0.8_13968.20150417/core/rtw_debug.c:118:4: note: in expansion of macro ‘DBG_871X_SEL_NL’
    DBG_871X_SEL_NL(sel, "0x%03x",i);
    ^
/home/ubuntu/rtl8188EUS_linux_v4.3.0.8_13968.20150417/include/rtw_debug.h:187:19: error: void value not ignored as it ought to be
  #define _seqdump seq_printf
                   ^
/home/ubuntu/rtl8188EUS_linux_v4.3.0.8_13968.20150417/include/rtw_debug.h:230:7: note: in expansion of macro ‘_seqdump’
    if(_seqdump(sel, fmt, ##arg)) /*rtw_warn_on(1)*/; \
       ^
/home/ubuntu/rtl8188EUS_linux_v4.3.0.8_13968.20150417/core/rtw_debug.c:119:3: note: in expansion of macro ‘DBG_871X_SEL’
   DBG_871X_SEL(sel, " 0x%08x ", rtw_read32(adapter,i));
   ^
/home/ubuntu/rtl8188EUS_linux_v4.3.0.8_13968.20150417/include/rtw_debug.h:187:19: error: void value not ignored as it ought to be
  #define _seqdump seq_printf
                   ^
/home/ubuntu/rtl8188EUS_linux_v4.3.0.8_13968.20150417/include/rtw_debug.h:230:7: note: in expansion of macro ‘_seqdump’
    if(_seqdump(sel, fmt, ##arg)) /*rtw_warn_on(1)*/; \
       ^
/home/ubuntu/rtl8188EUS_linux_v4.3.0.8_13968.20150417/core/rtw_debug.c:121:4: note: in expansion of macro ‘DBG_871X_SEL’
    DBG_871X_SEL(sel, "\n");
    ^
/home/ubuntu/rtl8188EUS_linux_v4.3.0.8_13968.20150417/core/rtw_debug.c: In function ‘rf_reg_dump’:
/home/ubuntu/rtl8188EUS_linux_v4.3.0.8_13968.20150417/include/rtw_debug.h:187:19: error: void value not ignored as it ought to be
  #define _seqdump seq_printf
                   ^
/home/ubuntu/rtl8188EUS_linux_v4.3.0.8_13968.20150417/include/rtw_debug.h:240:7: note: in expansion of macro ‘_seqdump’
    if(_seqdump(sel, fmt, ##arg)) /*rtw_warn_on(1)*/; \
       ^
/home/ubuntu/rtl8188EUS_linux_v4.3.0.8_13968.20150417/core/rtw_debug.c:138:2: note: in expansion of macro ‘DBG_871X_SEL_NL’
  DBG_871X_SEL_NL(sel, "======= RF REG =======\n");
  ^
/home/ubuntu/rtl8188EUS_linux_v4.3.0.8_13968.20150417/include/rtw_debug.h:187:19: error: void value not ignored as it ought to be
  #define _seqdump seq_printf
                   ^
/home/ubuntu/rtl8188EUS_linux_v4.3.0.8_13968.20150417/include/rtw_debug.h:240:7: note: in expansion of macro ‘_seqdump’
    if(_seqdump(sel, fmt, ##arg)) /*rtw_warn_on(1)*/; \
       ^
/home/ubuntu/rtl8188EUS_linux_v4.3.0.8_13968.20150417/core/rtw_debug.c:141:3: note: in expansion of macro ‘DBG_871X_SEL_NL’
   DBG_871X_SEL_NL(sel, "RF_Path(%x)\n",path);
   ^
/home/ubuntu/rtl8188EUS_linux_v4.3.0.8_13968.20150417/include/rtw_debug.h:187:19: error: void value not ignored as it ought to be
  #define _seqdump seq_printf
                   ^
/home/ubuntu/rtl8188EUS_linux_v4.3.0.8_13968.20150417/include/rtw_debug.h:240:7: note: in expansion of macro ‘_seqdump’
    if(_seqdump(sel, fmt, ##arg)) /*rtw_warn_on(1)*/; \
       ^
/home/ubuntu/rtl8188EUS_linux_v4.3.0.8_13968.20150417/core/rtw_debug.c:146:5: note: in expansion of macro ‘DBG_871X_SEL_NL’
     DBG_871X_SEL_NL(sel, "0x%02x ",i);
     ^
/home/ubuntu/rtl8188EUS_linux_v4.3.0.8_13968.20150417/include/rtw_debug.h:187:19: error: void value not ignored as it ought to be
  #define _seqdump seq_printf
                   ^
/home/ubuntu/rtl8188EUS_linux_v4.3.0.8_13968.20150417/include/rtw_debug.h:230:7: note: in expansion of macro ‘_seqdump’
    if(_seqdump(sel, fmt, ##arg)) /*rtw_warn_on(1)*/; \
       ^
/home/ubuntu/rtl8188EUS_linux_v4.3.0.8_13968.20150417/core/rtw_debug.c:147:4: note: in expansion of macro ‘DBG_871X_SEL’
    DBG_871X_SEL(sel, " 0x%08x ",value);
    ^
/home/ubuntu/rtl8188EUS_linux_v4.3.0.8_13968.20150417/include/rtw_debug.h:187:19: error: void value not ignored as it ought to be
  #define _seqdump seq_printf
                   ^
/home/ubuntu/rtl8188EUS_linux_v4.3.0.8_13968.20150417/include/rtw_debug.h:230:7: note: in expansion of macro ‘_seqdump’
    if(_seqdump(sel, fmt, ##arg)) /*rtw_warn_on(1)*/; \
       ^
/home/ubuntu/rtl8188EUS_linux_v4.3.0.8_13968.20150417/core/rtw_debug.c:149:5: note: in expansion of macro ‘DBG_871X_SEL’
     DBG_871X_SEL(sel, "\n");
     ^
/home/ubuntu/rtl8188EUS_linux_v4.3.0.8_13968.20150417/core/rtw_debug.c: In function ‘dump_adapters_status’:
/home/ubuntu/rtl8188EUS_linux_v4.3.0.8_13968.20150417/include/rtw_debug.h:187:19: error: void value not ignored as it ought to be
  #define _seqdump seq_printf
                   ^
/home/ubuntu/rtl8188EUS_linux_v4.3.0.8_13968.20150417/include/rtw_debug.h:240:7: note: in expansion of macro ‘_seqdump’
    if(_seqdump(sel, fmt, ##arg)) /*rtw_warn_on(1)*/; \
       ^
/home/ubuntu/rtl8188EUS_linux_v4.3.0.8_13968.20150417/core/rtw_debug.c:160:2: note: in expansion of macro ‘DBG_871X_SEL_NL’
  DBG_871X_SEL_NL(sel, "%-2s %-8s %-4s %-7s %s\n"
  ^
/home/ubuntu/rtl8188EUS_linux_v4.3.0.8_13968.20150417/include/rtw_debug.h:187:19: error: void value not ignored as it ought to be
  #define _seqdump seq_printf
                   ^
/home/ubuntu/rtl8188EUS_linux_v4.3.0.8_13968.20150417/include/rtw_debug.h:240:7: note: in expansion of macro ‘_seqdump’
    if(_seqdump(sel, fmt, ##arg)) /*rtw_warn_on(1)*/; \
       ^
/home/ubuntu/rtl8188EUS_linux_v4.3.0.8_13968.20150417/core/rtw_debug.c:163:2: note: in expansion of macro ‘DBG_871X_SEL_NL’
  DBG_871X_SEL_NL(sel, "------------------------\n");
  ^
/home/ubuntu/rtl8188EUS_linux_v4.3.0.8_13968.20150417/include/rtw_debug.h:187:19: error: void value not ignored as it ought to be
  #define _seqdump seq_printf
                   ^
/home/ubuntu/rtl8188EUS_linux_v4.3.0.8_13968.20150417/include/rtw_debug.h:240:7: note: in expansion of macro ‘_seqdump’
    if(_seqdump(sel, fmt, ##arg)) /*rtw_warn_on(1)*/; \
       ^
/home/ubuntu/rtl8188EUS_linux_v4.3.0.8_13968.20150417/core/rtw_debug.c:168:4: note: in expansion of macro ‘DBG_871X_SEL_NL’
    DBG_871X_SEL_NL(sel, "%2d %-8s %4hhu %3u,%u,%u "MLME_STATE_FMT" %s%s\n"
    ^
/home/ubuntu/rtl8188EUS_linux_v4.3.0.8_13968.20150417/include/rtw_debug.h:187:19: error: void value not ignored as it ought to be
  #define _seqdump seq_printf
                   ^
/home/ubuntu/rtl8188EUS_linux_v4.3.0.8_13968.20150417/include/rtw_debug.h:240:7: note: in expansion of macro ‘_seqdump’
    if(_seqdump(sel, fmt, ##arg)) /*rtw_warn_on(1)*/; \
       ^
/home/ubuntu/rtl8188EUS_linux_v4.3.0.8_13968.20150417/core/rtw_debug.c:181:2: note: in expansion of macro ‘DBG_871X_SEL_NL’
  DBG_871X_SEL_NL(sel, "------------------------\n");
  ^
/home/ubuntu/rtl8188EUS_linux_v4.3.0.8_13968.20150417/include/rtw_debug.h:187:19: error: void value not ignored as it ought to be
  #define _seqdump seq_printf
                   ^
/home/ubuntu/rtl8188EUS_linux_v4.3.0.8_13968.20150417/include/rtw_debug.h:240:7: note: in expansion of macro ‘_seqdump’
    if(_seqdump(sel, fmt, ##arg)) /*rtw_warn_on(1)*/; \
       ^
/home/ubuntu/rtl8188EUS_linux_v4.3.0.8_13968.20150417/core/rtw_debug.c:184:2: note: in expansion of macro ‘DBG_871X_SEL_NL’
  DBG_871X_SEL_NL(sel, "%16s %3u,%u,%u\n"
  ^
/home/ubuntu/rtl8188EUS_linux_v4.3.0.8_13968.20150417/include/rtw_debug.h:187:19: error: void value not ignored as it ought to be
  #define _seqdump seq_printf
                   ^
/home/ubuntu/rtl8188EUS_linux_v4.3.0.8_13968.20150417/include/rtw_debug.h:240:7: note: in expansion of macro ‘_seqdump’
    if(_seqdump(sel, fmt, ##arg)) /*rtw_warn_on(1)*/; \
       ^
/home/ubuntu/rtl8188EUS_linux_v4.3.0.8_13968.20150417/core/rtw_debug.c:189:2: note: in expansion of macro ‘DBG_871X_SEL_NL’
  DBG_871X_SEL_NL(sel, "%16s %3u,%u,%u\n"
  ^
/home/ubuntu/rtl8188EUS_linux_v4.3.0.8_13968.20150417/core/rtw_debug.c: In function ‘proc_get_read_reg’:
/home/ubuntu/rtl8188EUS_linux_v4.3.0.8_13968.20150417/include/rtw_debug.h:187:19: error: void value not ignored as it ought to be
  #define _seqdump seq_printf
                   ^
/home/ubuntu/rtl8188EUS_linux_v4.3.0.8_13968.20150417/include/rtw_debug.h:240:7: note: in expansion of macro ‘_seqdump’
    if(_seqdump(sel, fmt, ##arg)) /*rtw_warn_on(1)*/; \
       ^
/home/ubuntu/rtl8188EUS_linux_v4.3.0.8_13968.20150417/core/rtw_debug.c:251:3: note: in expansion of macro ‘DBG_871X_SEL_NL’
   DBG_871X_SEL_NL(m, "address not initialized\n");
   ^
/home/ubuntu/rtl8188EUS_linux_v4.3.0.8_13968.20150417/include/rtw_debug.h:187:19: error: void value not ignored as it ought to be
  #define _seqdump seq_printf
                   ^
/home/ubuntu/rtl8188EUS_linux_v4.3.0.8_13968.20150417/include/rtw_debug.h:240:7: note: in expansion of macro ‘_seqdump’
    if(_seqdump(sel, fmt, ##arg)) /*rtw_warn_on(1)*/; \
       ^
/home/ubuntu/rtl8188EUS_linux_v4.3.0.8_13968.20150417/core/rtw_debug.c:258:4: note: in expansion of macro ‘DBG_871X_SEL_NL’
    DBG_871X_SEL_NL(m, "rtw_read8(0x%x)=0x%x\n", proc_get_read_addr, rtw_read8(p
    ^
/home/ubuntu/rtl8188EUS_linux_v4.3.0.8_13968.20150417/include/rtw_debug.h:187:19: error: void value not ignored as it ought to be
  #define _seqdump seq_printf
                   ^
/home/ubuntu/rtl8188EUS_linux_v4.3.0.8_13968.20150417/include/rtw_debug.h:240:7: note: in expansion of macro ‘_seqdump’
    if(_seqdump(sel, fmt, ##arg)) /*rtw_warn_on(1)*/; \
       ^
/home/ubuntu/rtl8188EUS_linux_v4.3.0.8_13968.20150417/core/rtw_debug.c:261:4: note: in expansion of macro ‘DBG_871X_SEL_NL’
    DBG_871X_SEL_NL(m, "rtw_read16(0x%x)=0x%x\n", proc_get_read_addr, rtw_read16
    ^
/home/ubuntu/rtl8188EUS_linux_v4.3.0.8_13968.20150417/include/rtw_debug.h:187:19: error: void value not ignored as it ought to be
  #define _seqdump seq_printf
                   ^
/home/ubuntu/rtl8188EUS_linux_v4.3.0.8_13968.20150417/include/rtw_debug.h:240:7: note: in expansion of macro ‘_seqdump’
    if(_seqdump(sel, fmt, ##arg)) /*rtw_warn_on(1)*/; \
       ^
/home/ubuntu/rtl8188EUS_linux_v4.3.0.8_13968.20150417/core/rtw_debug.c:264:4: note: in expansion of macro ‘DBG_871X_SEL_NL’
    DBG_871X_SEL_NL(m, "rtw_read32(0x%x)=0x%x\n", proc_get_read_addr, rtw_read32
    ^
/home/ubuntu/rtl8188EUS_linux_v4.3.0.8_13968.20150417/include/rtw_debug.h:187:19: error: void value not ignored as it ought to be
  #define _seqdump seq_printf
                   ^
/home/ubuntu/rtl8188EUS_linux_v4.3.0.8_13968.20150417/include/rtw_debug.h:240:7: note: in expansion of macro ‘_seqdump’
    if(_seqdump(sel, fmt, ##arg)) /*rtw_warn_on(1)*/; \
       ^
/home/ubuntu/rtl8188EUS_linux_v4.3.0.8_13968.20150417/core/rtw_debug.c:267:4: note: in expansion of macro ‘DBG_871X_SEL_NL’
    DBG_871X_SEL_NL(m, "error read length=%d\n", proc_get_read_len);
    ^
/home/ubuntu/rtl8188EUS_linux_v4.3.0.8_13968.20150417/core/rtw_debug.c: In function ‘proc_get_fwstate’:
/home/ubuntu/rtl8188EUS_linux_v4.3.0.8_13968.20150417/include/rtw_debug.h:187:19: error: void value not ignored as it ought to be
  #define _seqdump seq_printf
                   ^
/home/ubuntu/rtl8188EUS_linux_v4.3.0.8_13968.20150417/include/rtw_debug.h:240:7: note: in expansion of macro ‘_seqdump’
    if(_seqdump(sel, fmt, ##arg)) /*rtw_warn_on(1)*/; \
       ^
/home/ubuntu/rtl8188EUS_linux_v4.3.0.8_13968.20150417/core/rtw_debug.c:310:2: note: in expansion of macro ‘DBG_871X_SEL_NL’
  DBG_871X_SEL_NL(m, "fwstate=0x%x\n", get_fwstate(pmlmepriv));
  ^
/home/ubuntu/rtl8188EUS_linux_v4.3.0.8_13968.20150417/core/rtw_debug.c: In function ‘proc_get_sec_info’:
/home/ubuntu/rtl8188EUS_linux_v4.3.0.8_13968.20150417/include/rtw_debug.h:187:19: error: void value not ignored as it ought to be
  #define _seqdump seq_printf
                   ^
/home/ubuntu/rtl8188EUS_linux_v4.3.0.8_13968.20150417/include/rtw_debug.h:240:7: note: in expansion of macro ‘_seqdump’
    if(_seqdump(sel, fmt, ##arg)) /*rtw_warn_on(1)*/; \
       ^
/home/ubuntu/rtl8188EUS_linux_v4.3.0.8_13968.20150417/core/rtw_debug.c:321:2: note: in expansion of macro ‘DBG_871X_SEL_NL’
  DBG_871X_SEL_NL(m, "auth_alg=0x%x, enc_alg=0x%x, auth_type=0x%x, enc_type=0x%x
  ^
/home/ubuntu/rtl8188EUS_linux_v4.3.0.8_13968.20150417/include/rtw_debug.h:187:19: error: void value not ignored as it ought to be
  #define _seqdump seq_printf
                   ^
/home/ubuntu/rtl8188EUS_linux_v4.3.0.8_13968.20150417/include/rtw_debug.h:240:7: note: in expansion of macro ‘_seqdump’
    if(_seqdump(sel, fmt, ##arg)) /*rtw_warn_on(1)*/; \
       ^
/home/ubuntu/rtl8188EUS_linux_v4.3.0.8_13968.20150417/core/rtw_debug.c:325:2: note: in expansion of macro ‘DBG_871X_SEL_NL’
  DBG_871X_SEL_NL(m, "hw_decrypted=%d\n", sec->hw_decrypted);
  ^
/home/ubuntu/rtl8188EUS_linux_v4.3.0.8_13968.20150417/include/rtw_debug.h:187:19: error: void value not ignored as it ought to be
  #define _seqdump seq_printf
                   ^
/home/ubuntu/rtl8188EUS_linux_v4.3.0.8_13968.20150417/include/rtw_debug.h:240:7: note: in expansion of macro ‘_seqdump’
    if(_seqdump(sel, fmt, ##arg)) /*rtw_warn_on(1)*/; \
       ^
/home/ubuntu/rtl8188EUS_linux_v4.3.0.8_13968.20150417/core/rtw_debug.c:328:2: note: in expansion of macro ‘DBG_871X_SEL_NL’
  DBG_871X_SEL_NL(m, "wep_sw_enc_cnt=%llu, %llu, %llu\n"
  ^
/home/ubuntu/rtl8188EUS_linux_v4.3.0.8_13968.20150417/include/rtw_debug.h:187:19: error: void value not ignored as it ought to be
  #define _seqdump seq_printf
                   ^
/home/ubuntu/rtl8188EUS_linux_v4.3.0.8_13968.20150417/include/rtw_debug.h:240:7: note: in expansion of macro ‘_seqdump’
    if(_seqdump(sel, fmt, ##arg)) /*rtw_warn_on(1)*/; \
       ^
/home/ubuntu/rtl8188EUS_linux_v4.3.0.8_13968.20150417/core/rtw_debug.c:330:2: note: in expansion of macro ‘DBG_871X_SEL_NL’
  DBG_871X_SEL_NL(m, "wep_sw_dec_cnt=%llu, %llu, %llu\n"
  ^
/home/ubuntu/rtl8188EUS_linux_v4.3.0.8_13968.20150417/include/rtw_debug.h:187:19: error: void value not ignored as it ought to be
  #define _seqdump seq_printf
                   ^
/home/ubuntu/rtl8188EUS_linux_v4.3.0.8_13968.20150417/include/rtw_debug.h:240:7: note: in expansion of macro ‘_seqdump’
    if(_seqdump(sel, fmt, ##arg)) /*rtw_warn_on(1)*/; \
       ^
/home/ubuntu/rtl8188EUS_linux_v4.3.0.8_13968.20150417/core/rtw_debug.c:333:2: note: in expansion of macro ‘DBG_871X_SEL_NL’
  DBG_871X_SEL_NL(m, "tkip_sw_enc_cnt=%llu, %llu, %llu\n"
  ^
/home/ubuntu/rtl8188EUS_linux_v4.3.0.8_13968.20150417/include/rtw_debug.h:187:19: error: void value not ignored as it ought to be
  #define _seqdump seq_printf
                   ^
/home/ubuntu/rtl8188EUS_linux_v4.3.0.8_13968.20150417/include/rtw_debug.h:240:7: note: in expansion of macro ‘_seqdump’
    if(_seqdump(sel, fmt, ##arg)) /*rtw_warn_on(1)*/; \
       ^
/home/ubuntu/rtl8188EUS_linux_v4.3.0.8_13968.20150417/core/rtw_debug.c:335:2: note: in expansion of macro ‘DBG_871X_SEL_NL’
  DBG_871X_SEL_NL(m, "tkip_sw_dec_cnt=%llu, %llu, %llu\n"
  ^
/home/ubuntu/rtl8188EUS_linux_v4.3.0.8_13968.20150417/include/rtw_debug.h:187:19: error: void value not ignored as it ought to be
  #define _seqdump seq_printf
                   ^
/home/ubuntu/rtl8188EUS_linux_v4.3.0.8_13968.20150417/include/rtw_debug.h:240:7: note: in expansion of macro ‘_seqdump’
    if(_seqdump(sel, fmt, ##arg)) /*rtw_warn_on(1)*/; \
       ^
/home/ubuntu/rtl8188EUS_linux_v4.3.0.8_13968.20150417/core/rtw_debug.c:338:2: note: in expansion of macro ‘DBG_871X_SEL_NL’
  DBG_871X_SEL_NL(m, "aes_sw_enc_cnt=%llu, %llu, %llu\n"
  ^
/home/ubuntu/rtl8188EUS_linux_v4.3.0.8_13968.20150417/include/rtw_debug.h:187:19: error: void value not ignored as it ought to be
  #define _seqdump seq_printf
                   ^
/home/ubuntu/rtl8188EUS_linux_v4.3.0.8_13968.20150417/include/rtw_debug.h:240:7: note: in expansion of macro ‘_seqdump’
    if(_seqdump(sel, fmt, ##arg)) /*rtw_warn_on(1)*/; \
       ^
/home/ubuntu/rtl8188EUS_linux_v4.3.0.8_13968.20150417/core/rtw_debug.c:340:2: note: in expansion of macro ‘DBG_871X_SEL_NL’
  DBG_871X_SEL_NL(m, "aes_sw_dec_cnt=%llu, %llu, %llu\n"
  ^
/home/ubuntu/rtl8188EUS_linux_v4.3.0.8_13968.20150417/core/rtw_debug.c: In function ‘proc_get_mlmext_state’:
/home/ubuntu/rtl8188EUS_linux_v4.3.0.8_13968.20150417/include/rtw_debug.h:187:19: error: void value not ignored as it ought to be
  #define _seqdump seq_printf
                   ^
/home/ubuntu/rtl8188EUS_linux_v4.3.0.8_13968.20150417/include/rtw_debug.h:240:7: note: in expansion of macro ‘_seqdump’
    if(_seqdump(sel, fmt, ##arg)) /*rtw_warn_on(1)*/; \
       ^
/home/ubuntu/rtl8188EUS_linux_v4.3.0.8_13968.20150417/core/rtw_debug.c:354:2: note: in expansion of macro ‘DBG_871X_SEL_NL’
  DBG_871X_SEL_NL(m, "pmlmeinfo->state=0x%x\n", pmlmeinfo->state);
  ^
/home/ubuntu/rtl8188EUS_linux_v4.3.0.8_13968.20150417/core/rtw_debug.c: In function ‘proc_get_roam_flags’:
/home/ubuntu/rtl8188EUS_linux_v4.3.0.8_13968.20150417/include/rtw_debug.h:187:19: error: void value not ignored as it ought to be
  #define _seqdump seq_printf
                   ^
/home/ubuntu/rtl8188EUS_linux_v4.3.0.8_13968.20150417/include/rtw_debug.h:240:7: note: in expansion of macro ‘_seqdump’
    if(_seqdump(sel, fmt, ##arg)) /*rtw_warn_on(1)*/; \
       ^
/home/ubuntu/rtl8188EUS_linux_v4.3.0.8_13968.20150417/core/rtw_debug.c:365:2: note: in expansion of macro ‘DBG_871X_SEL_NL’
  DBG_871X_SEL_NL(m, "0x%02x\n", rtw_roam_flags(adapter));
  ^
/home/ubuntu/rtl8188EUS_linux_v4.3.0.8_13968.20150417/core/rtw_debug.c: In function ‘proc_get_roam_param’:
/home/ubuntu/rtl8188EUS_linux_v4.3.0.8_13968.20150417/include/rtw_debug.h:187:19: error: void value not ignored as it ought to be
  #define _seqdump seq_printf
                   ^
/home/ubuntu/rtl8188EUS_linux_v4.3.0.8_13968.20150417/include/rtw_debug.h:240:7: note: in expansion of macro ‘_seqdump’
    if(_seqdump(sel, fmt, ##arg)) /*rtw_warn_on(1)*/; \
       ^
/home/ubuntu/rtl8188EUS_linux_v4.3.0.8_13968.20150417/core/rtw_debug.c:399:2: note: in expansion of macro ‘DBG_871X_SEL_NL’
  DBG_871X_SEL_NL(m, "%12s %12s %11s\n", "rssi_diff_th", "scanr_exp_ms", "scan_i
  ^
/home/ubuntu/rtl8188EUS_linux_v4.3.0.8_13968.20150417/include/rtw_debug.h:187:19: error: void value not ignored as it ought to be
  #define _seqdump seq_printf
                   ^
/home/ubuntu/rtl8188EUS_linux_v4.3.0.8_13968.20150417/include/rtw_debug.h:240:7: note: in expansion of macro ‘_seqdump’
    if(_seqdump(sel, fmt, ##arg)) /*rtw_warn_on(1)*/; \
       ^
/home/ubuntu/rtl8188EUS_linux_v4.3.0.8_13968.20150417/core/rtw_debug.c:400:2: note: in expansion of macro ‘DBG_871X_SEL_NL’
  DBG_871X_SEL_NL(m, "%-12u %-12u %-11u\n"
  ^
/home/ubuntu/rtl8188EUS_linux_v4.3.0.8_13968.20150417/core/rtw_debug.c: In function ‘proc_get_qos_option’:
/home/ubuntu/rtl8188EUS_linux_v4.3.0.8_13968.20150417/include/rtw_debug.h:187:19: error: void value not ignored as it ought to be
  #define _seqdump seq_printf
                   ^
/home/ubuntu/rtl8188EUS_linux_v4.3.0.8_13968.20150417/include/rtw_debug.h:240:7: note: in expansion of macro ‘_seqdump’
    if(_seqdump(sel, fmt, ##arg)) /*rtw_warn_on(1)*/; \
       ^
/home/ubuntu/rtl8188EUS_linux_v4.3.0.8_13968.20150417/core/rtw_debug.c:469:2: note: in expansion of macro ‘DBG_871X_SEL_NL’
  DBG_871X_SEL_NL(m, "qos_option=%d\n", pmlmepriv->qospriv.qos_option);
  ^
/home/ubuntu/rtl8188EUS_linux_v4.3.0.8_13968.20150417/core/rtw_debug.c: In function ‘proc_get_ht_option’:
/home/ubuntu/rtl8188EUS_linux_v4.3.0.8_13968.20150417/include/rtw_debug.h:187:19: error: void value not ignored as it ought to be
  #define _seqdump seq_printf
                   ^
/home/ubuntu/rtl8188EUS_linux_v4.3.0.8_13968.20150417/include/rtw_debug.h:240:7: note: in expansion of macro ‘_seqdump’
    if(_seqdump(sel, fmt, ##arg)) /*rtw_warn_on(1)*/; \
       ^
/home/ubuntu/rtl8188EUS_linux_v4.3.0.8_13968.20150417/core/rtw_debug.c:481:2: note: in expansion of macro ‘DBG_871X_SEL_NL’
  DBG_871X_SEL_NL(m, "ht_option=%d\n", pmlmepriv->htpriv.ht_option);
  ^
/home/ubuntu/rtl8188EUS_linux_v4.3.0.8_13968.20150417/core/rtw_debug.c: In function ‘proc_get_rf_info’:
/home/ubuntu/rtl8188EUS_linux_v4.3.0.8_13968.20150417/include/rtw_debug.h:187:19: error: void value not ignored as it ought to be
  #define _seqdump seq_printf
                   ^
/home/ubuntu/rtl8188EUS_linux_v4.3.0.8_13968.20150417/include/rtw_debug.h:240:7: note: in expansion of macro ‘_seqdump’
    if(_seqdump(sel, fmt, ##arg)) /*rtw_warn_on(1)*/; \
       ^
/home/ubuntu/rtl8188EUS_linux_v4.3.0.8_13968.20150417/core/rtw_debug.c:493:2: note: in expansion of macro ‘DBG_871X_SEL_NL’
  DBG_871X_SEL_NL(m, "cur_ch=%d, cur_bw=%d, cur_ch_offet=%d\n", 
  ^
/home/ubuntu/rtl8188EUS_linux_v4.3.0.8_13968.20150417/include/rtw_debug.h:187:19: error: void value not ignored as it ought to be
  #define _seqdump seq_printf
                   ^
/home/ubuntu/rtl8188EUS_linux_v4.3.0.8_13968.20150417/include/rtw_debug.h:240:7: note: in expansion of macro ‘_seqdump’
    if(_seqdump(sel, fmt, ##arg)) /*rtw_warn_on(1)*/; \
       ^
/home/ubuntu/rtl8188EUS_linux_v4.3.0.8_13968.20150417/core/rtw_debug.c:496:2: note: in expansion of macro ‘DBG_871X_SEL_NL’
  DBG_871X_SEL_NL(m, "oper_ch=%d, oper_bw=%d, oper_ch_offet=%d\n", 
  ^
/home/ubuntu/rtl8188EUS_linux_v4.3.0.8_13968.20150417/core/rtw_debug.c: In function ‘proc_get_survey_info’:
/home/ubuntu/rtl8188EUS_linux_v4.3.0.8_13968.20150417/include/rtw_debug.h:187:19: error: void value not ignored as it ought to be
  #define _seqdump seq_printf
                   ^
/home/ubuntu/rtl8188EUS_linux_v4.3.0.8_13968.20150417/include/rtw_debug.h:240:7: note: in expansion of macro ‘_seqdump’
    if(_seqdump(sel, fmt, ##arg)) /*rtw_warn_on(1)*/; \
       ^
/home/ubuntu/rtl8188EUS_linux_v4.3.0.8_13968.20150417/core/rtw_debug.c:528:2: note: in expansion of macro ‘DBG_871X_SEL_NL’
  DBG_871X_SEL_NL(m, "%5s  %-17s  %3s  %-3s  %-4s  %-4s  %5s  %32s  %32s\n", "in
  ^
/home/ubuntu/rtl8188EUS_linux_v4.3.0.8_13968.20150417/include/rtw_debug.h:187:19: error: void value not ignored as it ought to be
  #define _seqdump seq_printf
                   ^
/home/ubuntu/rtl8188EUS_linux_v4.3.0.8_13968.20150417/include/rtw_debug.h:240:7: note: in expansion of macro ‘_seqdump’
    if(_seqdump(sel, fmt, ##arg)) /*rtw_warn_on(1)*/; \
       ^
/home/ubuntu/rtl8188EUS_linux_v4.3.0.8_13968.20150417/core/rtw_debug.c:563:3: note: in expansion of macro ‘DBG_871X_SEL_NL’
   DBG_871X_SEL_NL(m, "%5d  "MAC_FMT"  %3d  %3d  %4d  %4d    %5d  %32s  %32s\n",
   ^
/home/ubuntu/rtl8188EUS_linux_v4.3.0.8_13968.20150417/core/rtw_debug.c: In function ‘proc_get_ap_info’:
/home/ubuntu/rtl8188EUS_linux_v4.3.0.8_13968.20150417/include/rtw_debug.h:187:19: error: void value not ignored as it ought to be
  #define _seqdump seq_printf
                   ^
/home/ubuntu/rtl8188EUS_linux_v4.3.0.8_13968.20150417/include/rtw_debug.h:240:7: note: in expansion of macro ‘_seqdump’
    if(_seqdump(sel, fmt, ##arg)) /*rtw_warn_on(1)*/; \
       ^
/home/ubuntu/rtl8188EUS_linux_v4.3.0.8_13968.20150417/core/rtw_debug.c:672:3: note: in expansion of macro ‘DBG_871X_SEL_NL’
   DBG_871X_SEL_NL(m, "SSID=%s\n", cur_network->network.Ssid.Ssid);  
   ^
/home/ubuntu/rtl8188EUS_linux_v4.3.0.8_13968.20150417/include/rtw_debug.h:187:19: error: void value not ignored as it ought to be
  #define _seqdump seq_printf
                   ^
/home/ubuntu/rtl8188EUS_linux_v4.3.0.8_13968.20150417/include/rtw_debug.h:240:7: note: in expansion of macro ‘_seqdump’
    if(_seqdump(sel, fmt, ##arg)) /*rtw_warn_on(1)*/; \
       ^
/home/ubuntu/rtl8188EUS_linux_v4.3.0.8_13968.20150417/core/rtw_debug.c:673:3: note: in expansion of macro ‘DBG_871X_SEL_NL’
   DBG_871X_SEL_NL(m, "sta's macaddr:" MAC_FMT "\n", MAC_ARG(psta->hwaddr));
   ^
/home/ubuntu/rtl8188EUS_linux_v4.3.0.8_13968.20150417/include/rtw_debug.h:187:19: error: void value not ignored as it ought to be
  #define _seqdump seq_printf
                   ^
/home/ubuntu/rtl8188EUS_linux_v4.3.0.8_13968.20150417/include/rtw_debug.h:240:7: note: in expansion of macro ‘_seqdump’
    if(_seqdump(sel, fmt, ##arg)) /*rtw_warn_on(1)*/; \
       ^
/home/ubuntu/rtl8188EUS_linux_v4.3.0.8_13968.20150417/core/rtw_debug.c:674:3: note: in expansion of macro ‘DBG_871X_SEL_NL’
   DBG_871X_SEL_NL(m, "cur_channel=%d, cur_bwmode=%d, cur_ch_offset=%d\n", pmlme
   ^
/home/ubuntu/rtl8188EUS_linux_v4.3.0.8_13968.20150417/include/rtw_debug.h:187:19: error: void value not ignored as it ought to be
  #define _seqdump seq_printf
                   ^
/home/ubuntu/rtl8188EUS_linux_v4.3.0.8_13968.20150417/include/rtw_debug.h:240:7: note: in expansion of macro ‘_seqdump’
    if(_seqdump(sel, fmt, ##arg)) /*rtw_warn_on(1)*/; \
       ^
/home/ubuntu/rtl8188EUS_linux_v4.3.0.8_13968.20150417/core/rtw_debug.c:675:3: note: in expansion of macro ‘DBG_871X_SEL_NL’
   DBG_871X_SEL_NL(m, "wireless_mode=0x%x, rtsen=%d, cts2slef=%d\n", psta->wirel
   ^
/home/ubuntu/rtl8188EUS_linux_v4.3.0.8_13968.20150417/include/rtw_debug.h:187:19: error: void value not ignored as it ought to be
  #define _seqdump seq_printf
                   ^
/home/ubuntu/rtl8188EUS_linux_v4.3.0.8_13968.20150417/include/rtw_debug.h:240:7: note: in expansion of macro ‘_seqdump’
    if(_seqdump(sel, fmt, ##arg)) /*rtw_warn_on(1)*/; \
       ^
/home/ubuntu/rtl8188EUS_linux_v4.3.0.8_13968.20150417/core/rtw_debug.c:676:3: note: in expansion of macro ‘DBG_871X_SEL_NL’
   DBG_871X_SEL_NL(m, "state=0x%x, aid=%d, macid=%d, raid=%d\n", psta->state, ps
   ^
/home/ubuntu/rtl8188EUS_linux_v4.3.0.8_13968.20150417/include/rtw_debug.h:187:19: error: void value not ignored as it ought to be
  #define _seqdump seq_printf
                   ^
/home/ubuntu/rtl8188EUS_linux_v4.3.0.8_13968.20150417/include/rtw_debug.h:240:7: note: in expansion of macro ‘_seqdump’
    if(_seqdump(sel, fmt, ##arg)) /*rtw_warn_on(1)*/; \
       ^
/home/ubuntu/rtl8188EUS_linux_v4.3.0.8_13968.20150417/core/rtw_debug.c:678:3: note: in expansion of macro ‘DBG_871X_SEL_NL’
   DBG_871X_SEL_NL(m, "qos_en=%d, ht_en=%d, init_rate=%d\n", psta->qos_option, p
   ^
/home/ubuntu/rtl8188EUS_linux_v4.3.0.8_13968.20150417/include/rtw_debug.h:187:19: error: void value not ignored as it ought to be
  #define _seqdump seq_printf
                   ^
/home/ubuntu/rtl8188EUS_linux_v4.3.0.8_13968.20150417/include/rtw_debug.h:240:7: note: in expansion of macro ‘_seqdump’
    if(_seqdump(sel, fmt, ##arg)) /*rtw_warn_on(1)*/; \
       ^
/home/ubuntu/rtl8188EUS_linux_v4.3.0.8_13968.20150417/core/rtw_debug.c:679:3: note: in expansion of macro ‘DBG_871X_SEL_NL’
   DBG_871X_SEL_NL(m, "bwmode=%d, ch_offset=%d, sgi_20m=%d,sgi_40m=%d\n", psta->
   ^
/home/ubuntu/rtl8188EUS_linux_v4.3.0.8_13968.20150417/include/rtw_debug.h:187:19: error: void value not ignored as it ought to be
  #define _seqdump seq_printf
                   ^
/home/ubuntu/rtl8188EUS_linux_v4.3.0.8_13968.20150417/include/rtw_debug.h:240:7: note: in expansion of macro ‘_seqdump’
    if(_seqdump(sel, fmt, ##arg)) /*rtw_warn_on(1)*/; \
       ^
/home/ubuntu/rtl8188EUS_linux_v4.3.0.8_13968.20150417/core/rtw_debug.c:680:3: note: in expansion of macro ‘DBG_871X_SEL_NL’
   DBG_871X_SEL_NL(m, "ampdu_enable = %d\n", psta->htpriv.ampdu_enable); 
   ^
/home/ubuntu/rtl8188EUS_linux_v4.3.0.8_13968.20150417/include/rtw_debug.h:187:19: error: void value not ignored as it ought to be
  #define _seqdump seq_printf
                   ^
/home/ubuntu/rtl8188EUS_linux_v4.3.0.8_13968.20150417/include/rtw_debug.h:240:7: note: in expansion of macro ‘_seqdump’
    if(_seqdump(sel, fmt, ##arg)) /*rtw_warn_on(1)*/; \
       ^
/home/ubuntu/rtl8188EUS_linux_v4.3.0.8_13968.20150417/core/rtw_debug.c:681:3: note: in expansion of macro ‘DBG_871X_SEL_NL’
   DBG_871X_SEL_NL(m, "agg_enable_bitmap=%x, candidate_tid_bitmap=%x\n", psta->h
   ^
/home/ubuntu/rtl8188EUS_linux_v4.3.0.8_13968.20150417/include/rtw_debug.h:187:19: error: void value not ignored as it ought to be
  #define _seqdump seq_printf
                   ^
/home/ubuntu/rtl8188EUS_linux_v4.3.0.8_13968.20150417/include/rtw_debug.h:240:7: note: in expansion of macro ‘_seqdump’
    if(_seqdump(sel, fmt, ##arg)) /*rtw_warn_on(1)*/; \
       ^
/home/ubuntu/rtl8188EUS_linux_v4.3.0.8_13968.20150417/core/rtw_debug.c:682:3: note: in expansion of macro ‘DBG_871X_SEL_NL’
   DBG_871X_SEL_NL(m, "ldpc_cap=0x%x, stbc_cap=0x%x, beamform_cap=0x%x\n", psta-
   ^
/home/ubuntu/rtl8188EUS_linux_v4.3.0.8_13968.20150417/include/rtw_debug.h:187:19: error: void value not ignored as it ought to be
  #define _seqdump seq_printf
                   ^
/home/ubuntu/rtl8188EUS_linux_v4.3.0.8_13968.20150417/include/rtw_debug.h:240:7: note: in expansion of macro ‘_seqdump’
    if(_seqdump(sel, fmt, ##arg)) /*rtw_warn_on(1)*/; \
       ^
/home/ubuntu/rtl8188EUS_linux_v4.3.0.8_13968.20150417/core/rtw_debug.c:695:5: note: in expansion of macro ‘DBG_871X_SEL_NL’
     DBG_871X_SEL_NL(m, "tid=%d, indicate_seq=%d\n", i, preorder_ctrl->indicate_
     ^
/home/ubuntu/rtl8188EUS_linux_v4.3.0.8_13968.20150417/include/rtw_debug.h:187:19: error: void value not ignored as it ought to be
  #define _seqdump seq_printf
                   ^
/home/ubuntu/rtl8188EUS_linux_v4.3.0.8_13968.20150417/include/rtw_debug.h:240:7: note: in expansion of macro ‘_seqdump’
    if(_seqdump(sel, fmt, ##arg)) /*rtw_warn_on(1)*/; \
       ^
/home/ubuntu/rtl8188EUS_linux_v4.3.0.8_13968.20150417/core/rtw_debug.c:702:3: note: in expansion of macro ‘DBG_871X_SEL_NL’
   DBG_871X_SEL_NL(m, "can't get sta's macaddr, cur_network's macaddr:" MAC_FMT 
   ^
/home/ubuntu/rtl8188EUS_linux_v4.3.0.8_13968.20150417/core/rtw_debug.c: In function ‘proc_get_trx_info’:
/home/ubuntu/rtl8188EUS_linux_v4.3.0.8_13968.20150417/include/rtw_debug.h:187:19: error: void value not ignored as it ought to be
  #define _seqdump seq_printf
                   ^
/home/ubuntu/rtl8188EUS_linux_v4.3.0.8_13968.20150417/include/rtw_debug.h:240:7: note: in expansion of macro ‘_seqdump’
    if(_seqdump(sel, fmt, ##arg)) /*rtw_warn_on(1)*/; \
       ^
/home/ubuntu/rtl8188EUS_linux_v4.3.0.8_13968.20150417/core/rtw_debug.c:719:2: note: in expansion of macro ‘DBG_871X_SEL_NL’
  DBG_871X_SEL_NL(m, "free_xmitbuf_cnt=%d, free_xmitframe_cnt=%d\n"
  ^
/home/ubuntu/rtl8188EUS_linux_v4.3.0.8_13968.20150417/include/rtw_debug.h:187:19: error: void value not ignored as it ought to be
  #define _seqdump seq_printf
                   ^
/home/ubuntu/rtl8188EUS_linux_v4.3.0.8_13968.20150417/include/rtw_debug.h:240:7: note: in expansion of macro ‘_seqdump’
    if(_seqdump(sel, fmt, ##arg)) /*rtw_warn_on(1)*/; \
       ^
/home/ubuntu/rtl8188EUS_linux_v4.3.0.8_13968.20150417/core/rtw_debug.c:721:2: note: in expansion of macro ‘DBG_871X_SEL_NL’
  DBG_871X_SEL_NL(m, "free_ext_xmitbuf_cnt=%d, free_xframe_ext_cnt=%d\n"
  ^
/home/ubuntu/rtl8188EUS_linux_v4.3.0.8_13968.20150417/include/rtw_debug.h:187:19: error: void value not ignored as it ought to be
  #define _seqdump seq_printf
                   ^
/home/ubuntu/rtl8188EUS_linux_v4.3.0.8_13968.20150417/include/rtw_debug.h:240:7: note: in expansion of macro ‘_seqdump’
    if(_seqdump(sel, fmt, ##arg)) /*rtw_warn_on(1)*/; \
       ^
/home/ubuntu/rtl8188EUS_linux_v4.3.0.8_13968.20150417/core/rtw_debug.c:723:2: note: in expansion of macro ‘DBG_871X_SEL_NL’
  DBG_871X_SEL_NL(m, "free_recvframe_cnt=%d\n"
  ^
/home/ubuntu/rtl8188EUS_linux_v4.3.0.8_13968.20150417/include/rtw_debug.h:187:19: error: void value not ignored as it ought to be
  #define _seqdump seq_printf
                   ^
/home/ubuntu/rtl8188EUS_linux_v4.3.0.8_13968.20150417/include/rtw_debug.h:240:7: note: in expansion of macro ‘_seqdump’
    if(_seqdump(sel, fmt, ##arg)) /*rtw_warn_on(1)*/; \
       ^
/home/ubuntu/rtl8188EUS_linux_v4.3.0.8_13968.20150417/core/rtw_debug.c:729:3: note: in expansion of macro ‘DBG_871X_SEL_NL’
   DBG_871X_SEL_NL(m, "%d, hwq.accnt=%d\n", i, phwxmit->accnt);
   ^
/home/ubuntu/rtl8188EUS_linux_v4.3.0.8_13968.20150417/include/rtw_debug.h:187:19: error: void value not ignored as it ought to be
  #define _seqdump seq_printf
                   ^
/home/ubuntu/rtl8188EUS_linux_v4.3.0.8_13968.20150417/include/rtw_debug.h:240:7: note: in expansion of macro ‘_seqdump’
    if(_seqdump(sel, fmt, ##arg)) /*rtw_warn_on(1)*/; \
       ^
/home/ubuntu/rtl8188EUS_linux_v4.3.0.8_13968.20150417/core/rtw_debug.c:733:2: note: in expansion of macro ‘DBG_871X_SEL_NL’
  DBG_871X_SEL_NL(m, "rx_urb_pending_cn=%d\n", precvpriv->rx_pending_cnt);
  ^
/home/ubuntu/rtl8188EUS_linux_v4.3.0.8_13968.20150417/core/rtw_debug.c: In function ‘proc_get_rate_ctl’:
/home/ubuntu/rtl8188EUS_linux_v4.3.0.8_13968.20150417/include/rtw_debug.h:187:19: error: void value not ignored as it ought to be
  #define _seqdump seq_printf
                   ^
/home/ubuntu/rtl8188EUS_linux_v4.3.0.8_13968.20150417/include/rtw_debug.h:240:7: note: in expansion of macro ‘_seqdump’
    if(_seqdump(sel, fmt, ##arg)) /*rtw_warn_on(1)*/; \
       ^
/home/ubuntu/rtl8188EUS_linux_v4.3.0.8_13968.20150417/core/rtw_debug.c:746:3: note: in expansion of macro ‘DBG_871X_SEL_NL’
   DBG_871X_SEL_NL(m, "FIX\n");
   ^
/home/ubuntu/rtl8188EUS_linux_v4.3.0.8_13968.20150417/include/rtw_debug.h:187:19: error: void value not ignored as it ought to be
  #define _seqdump seq_printf
                   ^
/home/ubuntu/rtl8188EUS_linux_v4.3.0.8_13968.20150417/include/rtw_debug.h:240:7: note: in expansion of macro ‘_seqdump’
    if(_seqdump(sel, fmt, ##arg)) /*rtw_warn_on(1)*/; \
       ^
/home/ubuntu/rtl8188EUS_linux_v4.3.0.8_13968.20150417/core/rtw_debug.c:747:3: note: in expansion of macro ‘DBG_871X_SEL_NL’
   DBG_871X_SEL_NL(m, "0x%02x\n", adapter->fix_rate);
   ^
/home/ubuntu/rtl8188EUS_linux_v4.3.0.8_13968.20150417/include/rtw_debug.h:187:19: error: void value not ignored as it ought to be
  #define _seqdump seq_printf
                   ^
/home/ubuntu/rtl8188EUS_linux_v4.3.0.8_13968.20150417/include/rtw_debug.h:240:7: note: in expansion of macro ‘_seqdump’
    if(_seqdump(sel, fmt, ##arg)) /*rtw_warn_on(1)*/; \
       ^
/home/ubuntu/rtl8188EUS_linux_v4.3.0.8_13968.20150417/core/rtw_debug.c:749:3: note: in expansion of macro ‘DBG_871X_SEL_NL’
   DBG_871X_SEL_NL(m, "RA\n");
   ^
/home/ubuntu/rtl8188EUS_linux_v4.3.0.8_13968.20150417/core/rtw_debug.c: In function ‘proc_get_suspend_resume_info’:
/home/ubuntu/rtl8188EUS_linux_v4.3.0.8_13968.20150417/include/rtw_debug.h:187:19: error: void value not ignored as it ought to be
  #define _seqdump seq_printf
                   ^
/home/ubuntu/rtl8188EUS_linux_v4.3.0.8_13968.20150417/include/rtw_debug.h:240:7: note: in expansion of macro ‘_seqdump’
    if(_seqdump(sel, fmt, ##arg)) /*rtw_warn_on(1)*/; \
       ^
/home/ubuntu/rtl8188EUS_linux_v4.3.0.8_13968.20150417/core/rtw_debug.c:820:2: note: in expansion of macro ‘DBG_871X_SEL_NL’
  DBG_871X_SEL_NL(m, "dbg_sdio_alloc_irq_cnt=%d\n", pdbgpriv->dbg_sdio_alloc_irq
  ^
/home/ubuntu/rtl8188EUS_linux_v4.3.0.8_13968.20150417/include/rtw_debug.h:187:19: error: void value not ignored as it ought to be
  #define _seqdump seq_printf
                   ^
/home/ubuntu/rtl8188EUS_linux_v4.3.0.8_13968.20150417/include/rtw_debug.h:240:7: note: in expansion of macro ‘_seqdump’
    if(_seqdump(sel, fmt, ##arg)) /*rtw_warn_on(1)*/; \
       ^
/home/ubuntu/rtl8188EUS_linux_v4.3.0.8_13968.20150417/core/rtw_debug.c:821:2: note: in expansion of macro ‘DBG_871X_SEL_NL’
  DBG_871X_SEL_NL(m, "dbg_sdio_free_irq_cnt=%d\n", pdbgpriv->dbg_sdio_free_irq_c
  ^
/home/ubuntu/rtl8188EUS_linux_v4.3.0.8_13968.20150417/include/rtw_debug.h:187:19: error: void value not ignored as it ought to be
  #define _seqdump seq_printf
                   ^
/home/ubuntu/rtl8188EUS_linux_v4.3.0.8_13968.20150417/include/rtw_debug.h:240:7: note: in expansion of macro ‘_seqdump’
    if(_seqdump(sel, fmt, ##arg)) /*rtw_warn_on(1)*/; \
       ^
/home/ubuntu/rtl8188EUS_linux_v4.3.0.8_13968.20150417/core/rtw_debug.c:822:2: note: in expansion of macro ‘DBG_871X_SEL_NL’
  DBG_871X_SEL_NL(m, "dbg_sdio_alloc_irq_error_cnt=%d\n",pdbgpriv->dbg_sdio_allo
  ^
/home/ubuntu/rtl8188EUS_linux_v4.3.0.8_13968.20150417/include/rtw_debug.h:187:19: error: void value not ignored as it ought to be
  #define _seqdump seq_printf
                   ^
/home/ubuntu/rtl8188EUS_linux_v4.3.0.8_13968.20150417/include/rtw_debug.h:240:7: note: in expansion of macro ‘_seqdump’
    if(_seqdump(sel, fmt, ##arg)) /*rtw_warn_on(1)*/; \
       ^
/home/ubuntu/rtl8188EUS_linux_v4.3.0.8_13968.20150417/core/rtw_debug.c:823:2: note: in expansion of macro ‘DBG_871X_SEL_NL’
  DBG_871X_SEL_NL(m, "dbg_sdio_free_irq_error_cnt=%d\n", pdbgpriv->dbg_sdio_free
  ^
/home/ubuntu/rtl8188EUS_linux_v4.3.0.8_13968.20150417/include/rtw_debug.h:187:19: error: void value not ignored as it ought to be
  #define _seqdump seq_printf
                   ^
/home/ubuntu/rtl8188EUS_linux_v4.3.0.8_13968.20150417/include/rtw_debug.h:240:7: note: in expansion of macro ‘_seqdump’
    if(_seqdump(sel, fmt, ##arg)) /*rtw_warn_on(1)*/; \
       ^
/home/ubuntu/rtl8188EUS_linux_v4.3.0.8_13968.20150417/core/rtw_debug.c:824:2: note: in expansion of macro ‘DBG_871X_SEL_NL’
  DBG_871X_SEL_NL(m, "dbg_sdio_init_error_cnt=%d\n",pdbgpriv->dbg_sdio_init_erro
  ^
/home/ubuntu/rtl8188EUS_linux_v4.3.0.8_13968.20150417/include/rtw_debug.h:187:19: error: void value not ignored as it ought to be
  #define _seqdump seq_printf
                   ^
/home/ubuntu/rtl8188EUS_linux_v4.3.0.8_13968.20150417/include/rtw_debug.h:240:7: note: in expansion of macro ‘_seqdump’
    if(_seqdump(sel, fmt, ##arg)) /*rtw_warn_on(1)*/; \
       ^
/home/ubuntu/rtl8188EUS_linux_v4.3.0.8_13968.20150417/core/rtw_debug.c:825:2: note: in expansion of macro ‘DBG_871X_SEL_NL’
  DBG_871X_SEL_NL(m, "dbg_sdio_deinit_error_cnt=%d\n", pdbgpriv->dbg_sdio_deinit
  ^
/home/ubuntu/rtl8188EUS_linux_v4.3.0.8_13968.20150417/include/rtw_debug.h:187:19: error: void value not ignored as it ought to be
  #define _seqdump seq_printf
                   ^
/home/ubuntu/rtl8188EUS_linux_v4.3.0.8_13968.20150417/include/rtw_debug.h:240:7: note: in expansion of macro ‘_seqdump’
    if(_seqdump(sel, fmt, ##arg)) /*rtw_warn_on(1)*/; \
       ^
/home/ubuntu/rtl8188EUS_linux_v4.3.0.8_13968.20150417/core/rtw_debug.c:826:2: note: in expansion of macro ‘DBG_871X_SEL_NL’
  DBG_871X_SEL_NL(m, "dbg_suspend_error_cnt=%d\n", pdbgpriv->dbg_suspend_error_c
  ^
/home/ubuntu/rtl8188EUS_linux_v4.3.0.8_13968.20150417/include/rtw_debug.h:187:19: error: void value not ignored as it ought to be
  #define _seqdump seq_printf
                   ^
/home/ubuntu/rtl8188EUS_linux_v4.3.0.8_13968.20150417/include/rtw_debug.h:240:7: note: in expansion of macro ‘_seqdump’
    if(_seqdump(sel, fmt, ##arg)) /*rtw_warn_on(1)*/; \
       ^
/home/ubuntu/rtl8188EUS_linux_v4.3.0.8_13968.20150417/core/rtw_debug.c:827:2: note: in expansion of macro ‘DBG_871X_SEL_NL’
  DBG_871X_SEL_NL(m, "dbg_suspend_cnt=%d\n",pdbgpriv->dbg_suspend_cnt);
  ^
/home/ubuntu/rtl8188EUS_linux_v4.3.0.8_13968.20150417/include/rtw_debug.h:187:19: error: void value not ignored as it ought to be
  #define _seqdump seq_printf
                   ^
/home/ubuntu/rtl8188EUS_linux_v4.3.0.8_13968.20150417/include/rtw_debug.h:240:7: note: in expansion of macro ‘_seqdump’
    if(_seqdump(sel, fmt, ##arg)) /*rtw_warn_on(1)*/; \
       ^
/home/ubuntu/rtl8188EUS_linux_v4.3.0.8_13968.20150417/core/rtw_debug.c:828:2: note: in expansion of macro ‘DBG_871X_SEL_NL’
  DBG_871X_SEL_NL(m, "dbg_resume_cnt=%d\n", pdbgpriv->dbg_resume_cnt);
  ^
/home/ubuntu/rtl8188EUS_linux_v4.3.0.8_13968.20150417/include/rtw_debug.h:187:19: error: void value not ignored as it ought to be
  #define _seqdump seq_printf
                   ^
/home/ubuntu/rtl8188EUS_linux_v4.3.0.8_13968.20150417/include/rtw_debug.h:240:7: note: in expansion of macro ‘_seqdump’
    if(_seqdump(sel, fmt, ##arg)) /*rtw_warn_on(1)*/; \
       ^
/home/ubuntu/rtl8188EUS_linux_v4.3.0.8_13968.20150417/core/rtw_debug.c:829:2: note: in expansion of macro ‘DBG_871X_SEL_NL’
  DBG_871X_SEL_NL(m, "dbg_resume_error_cnt=%d\n", pdbgpriv->dbg_resume_error_cnt
  ^
/home/ubuntu/rtl8188EUS_linux_v4.3.0.8_13968.20150417/include/rtw_debug.h:187:19: error: void value not ignored as it ought to be
  #define _seqdump seq_printf
                   ^
/home/ubuntu/rtl8188EUS_linux_v4.3.0.8_13968.20150417/include/rtw_debug.h:240:7: note: in expansion of macro ‘_seqdump’
    if(_seqdump(sel, fmt, ##arg)) /*rtw_warn_on(1)*/; \
       ^
/home/ubuntu/rtl8188EUS_linux_v4.3.0.8_13968.20150417/core/rtw_debug.c:830:2: note: in expansion of macro ‘DBG_871X_SEL_NL’
  DBG_871X_SEL_NL(m, "dbg_deinit_fail_cnt=%d\n",pdbgpriv->dbg_deinit_fail_cnt);
  ^
/home/ubuntu/rtl8188EUS_linux_v4.3.0.8_13968.20150417/include/rtw_debug.h:187:19: error: void value not ignored as it ought to be
  #define _seqdump seq_printf
                   ^
/home/ubuntu/rtl8188EUS_linux_v4.3.0.8_13968.20150417/include/rtw_debug.h:240:7: note: in expansion of macro ‘_seqdump’
    if(_seqdump(sel, fmt, ##arg)) /*rtw_warn_on(1)*/; \
       ^
/home/ubuntu/rtl8188EUS_linux_v4.3.0.8_13968.20150417/core/rtw_debug.c:831:2: note: in expansion of macro ‘DBG_871X_SEL_NL’
  DBG_871X_SEL_NL(m, "dbg_carddisable_cnt=%d\n", pdbgpriv->dbg_carddisable_cnt);
  ^
/home/ubuntu/rtl8188EUS_linux_v4.3.0.8_13968.20150417/include/rtw_debug.h:187:19: error: void value not ignored as it ought to be
  #define _seqdump seq_printf
                   ^
/home/ubuntu/rtl8188EUS_linux_v4.3.0.8_13968.20150417/include/rtw_debug.h:240:7: note: in expansion of macro ‘_seqdump’
    if(_seqdump(sel, fmt, ##arg)) /*rtw_warn_on(1)*/; \
       ^
/home/ubuntu/rtl8188EUS_linux_v4.3.0.8_13968.20150417/core/rtw_debug.c:832:2: note: in expansion of macro ‘DBG_871X_SEL_NL’
  DBG_871X_SEL_NL(m, "dbg_ps_insuspend_cnt=%d\n",pdbgpriv->dbg_ps_insuspend_cnt)
  ^
/home/ubuntu/rtl8188EUS_linux_v4.3.0.8_13968.20150417/include/rtw_debug.h:187:19: error: void value not ignored as it ought to be
  #define _seqdump seq_printf
                   ^
/home/ubuntu/rtl8188EUS_linux_v4.3.0.8_13968.20150417/include/rtw_debug.h:240:7: note: in expansion of macro ‘_seqdump’
    if(_seqdump(sel, fmt, ##arg)) /*rtw_warn_on(1)*/; \
       ^
/home/ubuntu/rtl8188EUS_linux_v4.3.0.8_13968.20150417/core/rtw_debug.c:833:2: note: in expansion of macro ‘DBG_871X_SEL_NL’
  DBG_871X_SEL_NL(m, "dbg_dev_unload_inIPS_cnt=%d\n", pdbgpriv->dbg_dev_unload_i
  ^
/home/ubuntu/rtl8188EUS_linux_v4.3.0.8_13968.20150417/include/rtw_debug.h:187:19: error: void value not ignored as it ought to be
  #define _seqdump seq_printf
                   ^
/home/ubuntu/rtl8188EUS_linux_v4.3.0.8_13968.20150417/include/rtw_debug.h:240:7: note: in expansion of macro ‘_seqdump’
    if(_seqdump(sel, fmt, ##arg)) /*rtw_warn_on(1)*/; \
       ^
/home/ubuntu/rtl8188EUS_linux_v4.3.0.8_13968.20150417/core/rtw_debug.c:834:2: note: in expansion of macro ‘DBG_871X_SEL_NL’
  DBG_871X_SEL_NL(m, "dbg_scan_pwr_state_cnt=%d\n", pdbgpriv->dbg_scan_pwr_state
  ^
/home/ubuntu/rtl8188EUS_linux_v4.3.0.8_13968.20150417/include/rtw_debug.h:187:19: error: void value not ignored as it ought to be
  #define _seqdump seq_printf
                   ^
/home/ubuntu/rtl8188EUS_linux_v4.3.0.8_13968.20150417/include/rtw_debug.h:240:7: note: in expansion of macro ‘_seqdump’
    if(_seqdump(sel, fmt, ##arg)) /*rtw_warn_on(1)*/; \
       ^
/home/ubuntu/rtl8188EUS_linux_v4.3.0.8_13968.20150417/core/rtw_debug.c:835:2: note: in expansion of macro ‘DBG_871X_SEL_NL’
  DBG_871X_SEL_NL(m, "dbg_downloadfw_pwr_state_cnt=%d\n", pdbgpriv->dbg_download
  ^
/home/ubuntu/rtl8188EUS_linux_v4.3.0.8_13968.20150417/include/rtw_debug.h:187:19: error: void value not ignored as it ought to be
  #define _seqdump seq_printf
                   ^
/home/ubuntu/rtl8188EUS_linux_v4.3.0.8_13968.20150417/include/rtw_debug.h:240:7: note: in expansion of macro ‘_seqdump’
    if(_seqdump(sel, fmt, ##arg)) /*rtw_warn_on(1)*/; \
       ^
/home/ubuntu/rtl8188EUS_linux_v4.3.0.8_13968.20150417/core/rtw_debug.c:836:2: note: in expansion of macro ‘DBG_871X_SEL_NL’
  DBG_871X_SEL_NL(m, "dbg_carddisable_error_cnt=%d\n", pdbgpriv->dbg_carddisable
  ^
/home/ubuntu/rtl8188EUS_linux_v4.3.0.8_13968.20150417/include/rtw_debug.h:187:19: error: void value not ignored as it ought to be
  #define _seqdump seq_printf
                   ^
/home/ubuntu/rtl8188EUS_linux_v4.3.0.8_13968.20150417/include/rtw_debug.h:240:7: note: in expansion of macro ‘_seqdump’
    if(_seqdump(sel, fmt, ##arg)) /*rtw_warn_on(1)*/; \
       ^
/home/ubuntu/rtl8188EUS_linux_v4.3.0.8_13968.20150417/core/rtw_debug.c:837:2: note: in expansion of macro ‘DBG_871X_SEL_NL’
  DBG_871X_SEL_NL(m, "dbg_fw_read_ps_state_fail_cnt=%d\n", pdbgpriv->dbg_fw_read
  ^
/home/ubuntu/rtl8188EUS_linux_v4.3.0.8_13968.20150417/include/rtw_debug.h:187:19: error: void value not ignored as it ought to be
  #define _seqdump seq_printf
                   ^
/home/ubuntu/rtl8188EUS_linux_v4.3.0.8_13968.20150417/include/rtw_debug.h:240:7: note: in expansion of macro ‘_seqdump’
    if(_seqdump(sel, fmt, ##arg)) /*rtw_warn_on(1)*/; \
       ^
/home/ubuntu/rtl8188EUS_linux_v4.3.0.8_13968.20150417/core/rtw_debug.c:838:2: note: in expansion of macro ‘DBG_871X_SEL_NL’
  DBG_871X_SEL_NL(m, "dbg_leave_ips_fail_cnt=%d\n", pdbgpriv->dbg_leave_ips_fail
  ^
/home/ubuntu/rtl8188EUS_linux_v4.3.0.8_13968.20150417/include/rtw_debug.h:187:19: error: void value not ignored as it ought to be
  #define _seqdump seq_printf
                   ^
/home/ubuntu/rtl8188EUS_linux_v4.3.0.8_13968.20150417/include/rtw_debug.h:240:7: note: in expansion of macro ‘_seqdump’
    if(_seqdump(sel, fmt, ##arg)) /*rtw_warn_on(1)*/; \
       ^
/home/ubuntu/rtl8188EUS_linux_v4.3.0.8_13968.20150417/core/rtw_debug.c:839:2: note: in expansion of macro ‘DBG_871X_SEL_NL’
  DBG_871X_SEL_NL(m, "dbg_leave_lps_fail_cnt=%d\n", pdbgpriv->dbg_leave_lps_fail
  ^
/home/ubuntu/rtl8188EUS_linux_v4.3.0.8_13968.20150417/include/rtw_debug.h:187:19: error: void value not ignored as it ought to be
  #define _seqdump seq_printf
                   ^
/home/ubuntu/rtl8188EUS_linux_v4.3.0.8_13968.20150417/include/rtw_debug.h:240:7: note: in expansion of macro ‘_seqdump’
    if(_seqdump(sel, fmt, ##arg)) /*rtw_warn_on(1)*/; \
       ^
/home/ubuntu/rtl8188EUS_linux_v4.3.0.8_13968.20150417/core/rtw_debug.c:840:2: note: in expansion of macro ‘DBG_871X_SEL_NL’
  DBG_871X_SEL_NL(m, "dbg_h2c_leave32k_fail_cnt=%d\n", pdbgpriv->dbg_h2c_leave32
  ^
/home/ubuntu/rtl8188EUS_linux_v4.3.0.8_13968.20150417/include/rtw_debug.h:187:19: error: void value not ignored as it ought to be
  #define _seqdump seq_printf
                   ^
/home/ubuntu/rtl8188EUS_linux_v4.3.0.8_13968.20150417/include/rtw_debug.h:240:7: note: in expansion of macro ‘_seqdump’
    if(_seqdump(sel, fmt, ##arg)) /*rtw_warn_on(1)*/; \
       ^
/home/ubuntu/rtl8188EUS_linux_v4.3.0.8_13968.20150417/core/rtw_debug.c:841:2: note: in expansion of macro ‘DBG_871X_SEL_NL’
  DBG_871X_SEL_NL(m, "dbg_diswow_dload_fw_fail_cnt=%d\n", pdbgpriv->dbg_diswow_d
  ^
/home/ubuntu/rtl8188EUS_linux_v4.3.0.8_13968.20150417/include/rtw_debug.h:187:19: error: void value not ignored as it ought to be
  #define _seqdump seq_printf
                   ^
/home/ubuntu/rtl8188EUS_linux_v4.3.0.8_13968.20150417/include/rtw_debug.h:240:7: note: in expansion of macro ‘_seqdump’
    if(_seqdump(sel, fmt, ##arg)) /*rtw_warn_on(1)*/; \
       ^
/home/ubuntu/rtl8188EUS_linux_v4.3.0.8_13968.20150417/core/rtw_debug.c:842:2: note: in expansion of macro ‘DBG_871X_SEL_NL’
  DBG_871X_SEL_NL(m, "dbg_enwow_dload_fw_fail_cnt=%d\n", pdbgpriv->dbg_enwow_dlo
  ^
/home/ubuntu/rtl8188EUS_linux_v4.3.0.8_13968.20150417/include/rtw_debug.h:187:19: error: void value not ignored as it ought to be
  #define _seqdump seq_printf
                   ^
/home/ubuntu/rtl8188EUS_linux_v4.3.0.8_13968.20150417/include/rtw_debug.h:240:7: note: in expansion of macro ‘_seqdump’
    if(_seqdump(sel, fmt, ##arg)) /*rtw_warn_on(1)*/; \
       ^
/home/ubuntu/rtl8188EUS_linux_v4.3.0.8_13968.20150417/core/rtw_debug.c:843:2: note: in expansion of macro ‘DBG_871X_SEL_NL’
  DBG_871X_SEL_NL(m, "dbg_ips_drvopen_fail_cnt=%d\n", pdbgpriv->dbg_ips_drvopen_
  ^
/home/ubuntu/rtl8188EUS_linux_v4.3.0.8_13968.20150417/include/rtw_debug.h:187:19: error: void value not ignored as it ought to be
  #define _seqdump seq_printf
                   ^
/home/ubuntu/rtl8188EUS_linux_v4.3.0.8_13968.20150417/include/rtw_debug.h:240:7: note: in expansion of macro ‘_seqdump’
    if(_seqdump(sel, fmt, ##arg)) /*rtw_warn_on(1)*/; \
       ^
/home/ubuntu/rtl8188EUS_linux_v4.3.0.8_13968.20150417/core/rtw_debug.c:844:2: note: in expansion of macro ‘DBG_871X_SEL_NL’
  DBG_871X_SEL_NL(m, "dbg_poll_fail_cnt=%d\n", pdbgpriv->dbg_poll_fail_cnt);
  ^
/home/ubuntu/rtl8188EUS_linux_v4.3.0.8_13968.20150417/include/rtw_debug.h:187:19: error: void value not ignored as it ought to be
  #define _seqdump seq_printf
                   ^
/home/ubuntu/rtl8188EUS_linux_v4.3.0.8_13968.20150417/include/rtw_debug.h:240:7: note: in expansion of macro ‘_seqdump’
    if(_seqdump(sel, fmt, ##arg)) /*rtw_warn_on(1)*/; \
       ^
/home/ubuntu/rtl8188EUS_linux_v4.3.0.8_13968.20150417/core/rtw_debug.c:845:2: note: in expansion of macro ‘DBG_871X_SEL_NL’
  DBG_871X_SEL_NL(m, "dbg_rpwm_toogle_cnt=%d\n", pdbgpriv->dbg_rpwm_toogle_cnt);
  ^
/home/ubuntu/rtl8188EUS_linux_v4.3.0.8_13968.20150417/include/rtw_debug.h:187:19: error: void value not ignored as it ought to be
  #define _seqdump seq_printf
                   ^
/home/ubuntu/rtl8188EUS_linux_v4.3.0.8_13968.20150417/include/rtw_debug.h:240:7: note: in expansion of macro ‘_seqdump’
    if(_seqdump(sel, fmt, ##arg)) /*rtw_warn_on(1)*/; \
       ^
/home/ubuntu/rtl8188EUS_linux_v4.3.0.8_13968.20150417/core/rtw_debug.c:846:2: note: in expansion of macro ‘DBG_871X_SEL_NL’
  DBG_871X_SEL_NL(m, "dbg_rpwm_timeout_fail_cnt=%d\n", pdbgpriv->dbg_rpwm_timeou
  ^
/home/ubuntu/rtl8188EUS_linux_v4.3.0.8_13968.20150417/include/rtw_debug.h:187:19: error: void value not ignored as it ought to be
  #define _seqdump seq_printf
                   ^
/home/ubuntu/rtl8188EUS_linux_v4.3.0.8_13968.20150417/include/rtw_debug.h:240:7: note: in expansion of macro ‘_seqdump’
    if(_seqdump(sel, fmt, ##arg)) /*rtw_warn_on(1)*/; \
       ^
/home/ubuntu/rtl8188EUS_linux_v4.3.0.8_13968.20150417/core/rtw_debug.c:847:2: note: in expansion of macro ‘DBG_871X_SEL_NL’
  DBG_871X_SEL_NL(m, "dbg_sreset_cnt=%d\n", pdbgpriv->dbg_sreset_cnt);
  ^
/home/ubuntu/rtl8188EUS_linux_v4.3.0.8_13968.20150417/core/rtw_debug.c: In function ‘proc_get_rx_signal’:
/home/ubuntu/rtl8188EUS_linux_v4.3.0.8_13968.20150417/include/rtw_debug.h:187:19: error: void value not ignored as it ought to be
  #define _seqdump seq_printf
                   ^
/home/ubuntu/rtl8188EUS_linux_v4.3.0.8_13968.20150417/include/rtw_debug.h:240:7: note: in expansion of macro ‘_seqdump’
    if(_seqdump(sel, fmt, ##arg)) /*rtw_warn_on(1)*/; \
       ^
/home/ubuntu/rtl8188EUS_linux_v4.3.0.8_13968.20150417/core/rtw_debug.c:858:2: note: in expansion of macro ‘DBG_871X_SEL_NL’
  DBG_871X_SEL_NL(m, "rssi:%d\n", padapter->recvpriv.rssi);
  ^
/home/ubuntu/rtl8188EUS_linux_v4.3.0.8_13968.20150417/include/rtw_debug.h:187:19: error: void value not ignored as it ought to be
  #define _seqdump seq_printf
                   ^
/home/ubuntu/rtl8188EUS_linux_v4.3.0.8_13968.20150417/include/rtw_debug.h:240:7: note: in expansion of macro ‘_seqdump’
    if(_seqdump(sel, fmt, ##arg)) /*rtw_warn_on(1)*/; \
       ^
/home/ubuntu/rtl8188EUS_linux_v4.3.0.8_13968.20150417/core/rtw_debug.c:860:2: note: in expansion of macro ‘DBG_871X_SEL_NL’
  DBG_871X_SEL_NL(m, "signal_strength:%u\n", padapter->recvpriv.signal_strength)
  ^
/home/ubuntu/rtl8188EUS_linux_v4.3.0.8_13968.20150417/include/rtw_debug.h:187:19: error: void value not ignored as it ought to be
  #define _seqdump seq_printf
                   ^
/home/ubuntu/rtl8188EUS_linux_v4.3.0.8_13968.20150417/include/rtw_debug.h:240:7: note: in expansion of macro ‘_seqdump’
    if(_seqdump(sel, fmt, ##arg)) /*rtw_warn_on(1)*/; \
       ^
/home/ubuntu/rtl8188EUS_linux_v4.3.0.8_13968.20150417/core/rtw_debug.c:861:2: note: in expansion of macro ‘DBG_871X_SEL_NL’
  DBG_871X_SEL_NL(m, "signal_qual:%u\n", padapter->recvpriv.signal_qual);
  ^
/home/ubuntu/rtl8188EUS_linux_v4.3.0.8_13968.20150417/include/rtw_debug.h:187:19: error: void value not ignored as it ought to be
  #define _seqdump seq_printf
                   ^
/home/ubuntu/rtl8188EUS_linux_v4.3.0.8_13968.20150417/include/rtw_debug.h:240:7: note: in expansion of macro ‘_seqdump’
    if(_seqdump(sel, fmt, ##arg)) /*rtw_warn_on(1)*/; \
       ^
/home/ubuntu/rtl8188EUS_linux_v4.3.0.8_13968.20150417/core/rtw_debug.c:862:2: note: in expansion of macro ‘DBG_871X_SEL_NL’
  DBG_871X_SEL_NL(m, "noise:%u\n", padapter->recvpriv.noise);
  ^
/home/ubuntu/rtl8188EUS_linux_v4.3.0.8_13968.20150417/core/rtw_debug.c: In function ‘proc_get_hw_status’:
/home/ubuntu/rtl8188EUS_linux_v4.3.0.8_13968.20150417/include/rtw_debug.h:187:19: error: void value not ignored as it ought to be
  #define _seqdump seq_printf
                   ^
/home/ubuntu/rtl8188EUS_linux_v4.3.0.8_13968.20150417/include/rtw_debug.h:240:7: note: in expansion of macro ‘_seqdump’
    if(_seqdump(sel, fmt, ##arg)) /*rtw_warn_on(1)*/; \
       ^
/home/ubuntu/rtl8188EUS_linux_v4.3.0.8_13968.20150417/core/rtw_debug.c:878:2: note: in expansion of macro ‘DBG_871X_SEL_NL’
  DBG_871X_SEL_NL(m, "RX FIFO full count: last_time=%lld, current_time=%lld, dif
  ^
/home/ubuntu/rtl8188EUS_linux_v4.3.0.8_13968.20150417/core/rtw_debug.c: In function ‘proc_get_ht_enable’:
/home/ubuntu/rtl8188EUS_linux_v4.3.0.8_13968.20150417/include/rtw_debug.h:187:19: error: void value not ignored as it ought to be
  #define _seqdump seq_printf
                   ^
/home/ubuntu/rtl8188EUS_linux_v4.3.0.8_13968.20150417/include/rtw_debug.h:240:7: note: in expansion of macro ‘_seqdump’
    if(_seqdump(sel, fmt, ##arg)) /*rtw_warn_on(1)*/; \
       ^
/home/ubuntu/rtl8188EUS_linux_v4.3.0.8_13968.20150417/core/rtw_debug.c:927:3: note: in expansion of macro ‘DBG_871X_SEL_NL’
   DBG_871X_SEL_NL(m, "%d\n", pregpriv->ht_enable);
   ^
/home/ubuntu/rtl8188EUS_linux_v4.3.0.8_13968.20150417/core/rtw_debug.c: In function ‘proc_get_bw_mode’:
/home/ubuntu/rtl8188EUS_linux_v4.3.0.8_13968.20150417/include/rtw_debug.h:187:19: error: void value not ignored as it ought to be
  #define _seqdump seq_printf
                   ^
/home/ubuntu/rtl8188EUS_linux_v4.3.0.8_13968.20150417/include/rtw_debug.h:240:7: note: in expansion of macro ‘_seqdump’
    if(_seqdump(sel, fmt, ##arg)) /*rtw_warn_on(1)*/; \
       ^
/home/ubuntu/rtl8188EUS_linux_v4.3.0.8_13968.20150417/core/rtw_debug.c:965:3: note: in expansion of macro ‘DBG_871X_SEL_NL’
   DBG_871X_SEL_NL(m, "0x%02x\n", pregpriv->bw_mode);
   ^
/home/ubuntu/rtl8188EUS_linux_v4.3.0.8_13968.20150417/core/rtw_debug.c: In function ‘proc_get_ampdu_enable’:
/home/ubuntu/rtl8188EUS_linux_v4.3.0.8_13968.20150417/include/rtw_debug.h:187:19: error: void value not ignored as it ought to be
  #define _seqdump seq_printf
                   ^
/home/ubuntu/rtl8188EUS_linux_v4.3.0.8_13968.20150417/include/rtw_debug.h:240:7: note: in expansion of macro ‘_seqdump’
    if(_seqdump(sel, fmt, ##arg)) /*rtw_warn_on(1)*/; \
       ^
/home/ubuntu/rtl8188EUS_linux_v4.3.0.8_13968.20150417/core/rtw_debug.c:1005:3: note: in expansion of macro ‘DBG_871X_SEL_NL’
   DBG_871X_SEL_NL(m, "%d\n", pregpriv->ampdu_enable);
   ^
/home/ubuntu/rtl8188EUS_linux_v4.3.0.8_13968.20150417/core/rtw_debug.c: In function ‘proc_get_rx_ampdu’:
/home/ubuntu/rtl8188EUS_linux_v4.3.0.8_13968.20150417/include/rtw_debug.h:187:19: error: void value not ignored as it ought to be
  #define _seqdump seq_printf
                   ^
/home/ubuntu/rtl8188EUS_linux_v4.3.0.8_13968.20150417/include/rtw_debug.h:240:7: note: in expansion of macro ‘_seqdump’
    if(_seqdump(sel, fmt, ##arg)) /*rtw_warn_on(1)*/; \
       ^
/home/ubuntu/rtl8188EUS_linux_v4.3.0.8_13968.20150417/core/rtw_debug.c:1046:3: note: in expansion of macro ‘DBG_871X_SEL_NL’
   DBG_871X_SEL_NL(m,
   ^
/home/ubuntu/rtl8188EUS_linux_v4.3.0.8_13968.20150417/core/rtw_debug.c: In function ‘proc_get_en_fwps’:
/home/ubuntu/rtl8188EUS_linux_v4.3.0.8_13968.20150417/include/rtw_debug.h:187:19: error: void value not ignored as it ought to be
  #define _seqdump seq_printf
                   ^
/home/ubuntu/rtl8188EUS_linux_v4.3.0.8_13968.20150417/include/rtw_debug.h:240:7: note: in expansion of macro ‘_seqdump’
    if(_seqdump(sel, fmt, ##arg)) /*rtw_warn_on(1)*/; \
       ^
/home/ubuntu/rtl8188EUS_linux_v4.3.0.8_13968.20150417/core/rtw_debug.c:1097:3: note: in expansion of macro ‘DBG_871X_SEL_NL’
   DBG_871X_SEL_NL(m, "check_fw_ps = %d , 1:enable get FW PS state , 0: disable 
   ^
/home/ubuntu/rtl8188EUS_linux_v4.3.0.8_13968.20150417/core/rtw_debug.c: In function ‘proc_get_rx_stbc’:
/home/ubuntu/rtl8188EUS_linux_v4.3.0.8_13968.20150417/include/rtw_debug.h:187:19: error: void value not ignored as it ought to be
  #define _seqdump seq_printf
                   ^
/home/ubuntu/rtl8188EUS_linux_v4.3.0.8_13968.20150417/include/rtw_debug.h:240:7: note: in expansion of macro ‘_seqdump’
    if(_seqdump(sel, fmt, ##arg)) /*rtw_warn_on(1)*/; \
       ^
/home/ubuntu/rtl8188EUS_linux_v4.3.0.8_13968.20150417/core/rtw_debug.c:1152:3: note: in expansion of macro ‘DBG_871X_SEL_NL’
   DBG_871X_SEL_NL(m, "%d\n", pregpriv->rx_stbc);
   ^
/home/ubuntu/rtl8188EUS_linux_v4.3.0.8_13968.20150417/core/rtw_debug.c: In function ‘proc_get_all_sta_info’:
/home/ubuntu/rtl8188EUS_linux_v4.3.0.8_13968.20150417/include/rtw_debug.h:187:19: error: void value not ignored as it ought to be
  #define _seqdump seq_printf
                   ^
/home/ubuntu/rtl8188EUS_linux_v4.3.0.8_13968.20150417/include/rtw_debug.h:240:7: note: in expansion of macro ‘_seqdump’
    if(_seqdump(sel, fmt, ##arg)) /*rtw_warn_on(1)*/; \
       ^
/home/ubuntu/rtl8188EUS_linux_v4.3.0.8_13968.20150417/core/rtw_debug.c:1243:2: note: in expansion of macro ‘DBG_871X_SEL_NL’
  DBG_871X_SEL_NL(m, "sta_dz_bitmap=0x%x, tim_bitmap=0x%x\n", pstapriv->sta_dz_b
  ^
/home/ubuntu/rtl8188EUS_linux_v4.3.0.8_13968.20150417/include/rtw_debug.h:187:19: error: void value not ignored as it ought to be
  #define _seqdump seq_printf
                   ^
/home/ubuntu/rtl8188EUS_linux_v4.3.0.8_13968.20150417/include/rtw_debug.h:240:7: note: in expansion of macro ‘_seqdump’
    if(_seqdump(sel, fmt, ##arg)) /*rtw_warn_on(1)*/; \
       ^
/home/ubuntu/rtl8188EUS_linux_v4.3.0.8_13968.20150417/core/rtw_debug.c:1260:5: note: in expansion of macro ‘DBG_871X_SEL_NL’
     DBG_871X_SEL_NL(m, "==============================\n");
     ^
/home/ubuntu/rtl8188EUS_linux_v4.3.0.8_13968.20150417/include/rtw_debug.h:187:19: error: void value not ignored as it ought to be
  #define _seqdump seq_printf
                   ^
/home/ubuntu/rtl8188EUS_linux_v4.3.0.8_13968.20150417/include/rtw_debug.h:240:7: note: in expansion of macro ‘_seqdump’
    if(_seqdump(sel, fmt, ##arg)) /*rtw_warn_on(1)*/; \
       ^
/home/ubuntu/rtl8188EUS_linux_v4.3.0.8_13968.20150417/core/rtw_debug.c:1261:5: note: in expansion of macro ‘DBG_871X_SEL_NL’
     DBG_871X_SEL_NL(m, "sta's macaddr:" MAC_FMT "\n", MAC_ARG(psta->hwaddr));
     ^
/home/ubuntu/rtl8188EUS_linux_v4.3.0.8_13968.20150417/include/rtw_debug.h:187:19: error: void value not ignored as it ought to be
  #define _seqdump seq_printf
                   ^
/home/ubuntu/rtl8188EUS_linux_v4.3.0.8_13968.20150417/include/rtw_debug.h:240:7: note: in expansion of macro ‘_seqdump’
    if(_seqdump(sel, fmt, ##arg)) /*rtw_warn_on(1)*/; \
       ^
/home/ubuntu/rtl8188EUS_linux_v4.3.0.8_13968.20150417/core/rtw_debug.c:1262:5: note: in expansion of macro ‘DBG_871X_SEL_NL’
     DBG_871X_SEL_NL(m, "rtsen=%d, cts2slef=%d\n", psta->rtsen, psta->cts2self);
     ^
/home/ubuntu/rtl8188EUS_linux_v4.3.0.8_13968.20150417/include/rtw_debug.h:187:19: error: void value not ignored as it ought to be
  #define _seqdump seq_printf
                   ^
/home/ubuntu/rtl8188EUS_linux_v4.3.0.8_13968.20150417/include/rtw_debug.h:240:7: note: in expansion of macro ‘_seqdump’
    if(_seqdump(sel, fmt, ##arg)) /*rtw_warn_on(1)*/; \
       ^
/home/ubuntu/rtl8188EUS_linux_v4.3.0.8_13968.20150417/core/rtw_debug.c:1263:5: note: in expansion of macro ‘DBG_871X_SEL_NL’
     DBG_871X_SEL_NL(m, "state=0x%x, aid=%d, macid=%d, raid=%d\n", psta->state, 
     ^
/home/ubuntu/rtl8188EUS_linux_v4.3.0.8_13968.20150417/include/rtw_debug.h:187:19: error: void value not ignored as it ought to be
  #define _seqdump seq_printf
                   ^
/home/ubuntu/rtl8188EUS_linux_v4.3.0.8_13968.20150417/include/rtw_debug.h:240:7: note: in expansion of macro ‘_seqdump’
    if(_seqdump(sel, fmt, ##arg)) /*rtw_warn_on(1)*/; \
       ^
/home/ubuntu/rtl8188EUS_linux_v4.3.0.8_13968.20150417/core/rtw_debug.c:1265:5: note: in expansion of macro ‘DBG_871X_SEL_NL’
     DBG_871X_SEL_NL(m, "qos_en=%d, ht_en=%d, init_rate=%d\n", psta->qos_option,
     ^
/home/ubuntu/rtl8188EUS_linux_v4.3.0.8_13968.20150417/include/rtw_debug.h:187:19: error: void value not ignored as it ought to be
  #define _seqdump seq_printf
                   ^
/home/ubuntu/rtl8188EUS_linux_v4.3.0.8_13968.20150417/include/rtw_debug.h:240:7: note: in expansion of macro ‘_seqdump’
    if(_seqdump(sel, fmt, ##arg)) /*rtw_warn_on(1)*/; \
       ^
/home/ubuntu/rtl8188EUS_linux_v4.3.0.8_13968.20150417/core/rtw_debug.c:1266:5: note: in expansion of macro ‘DBG_871X_SEL_NL’
     DBG_871X_SEL_NL(m, "bwmode=%d, ch_offset=%d, sgi_20m=%d,sgi_40m=%d\n", psta
     ^
/home/ubuntu/rtl8188EUS_linux_v4.3.0.8_13968.20150417/include/rtw_debug.h:187:19: error: void value not ignored as it ought to be
  #define _seqdump seq_printf
                   ^
/home/ubuntu/rtl8188EUS_linux_v4.3.0.8_13968.20150417/include/rtw_debug.h:240:7: note: in expansion of macro ‘_seqdump’
    if(_seqdump(sel, fmt, ##arg)) /*rtw_warn_on(1)*/; \
       ^
/home/ubuntu/rtl8188EUS_linux_v4.3.0.8_13968.20150417/core/rtw_debug.c:1267:5: note: in expansion of macro ‘DBG_871X_SEL_NL’
     DBG_871X_SEL_NL(m, "ampdu_enable = %d\n", psta->htpriv.ampdu_enable);      
     ^
/home/ubuntu/rtl8188EUS_linux_v4.3.0.8_13968.20150417/include/rtw_debug.h:187:19: error: void value not ignored as it ought to be
  #define _seqdump seq_printf
                   ^
/home/ubuntu/rtl8188EUS_linux_v4.3.0.8_13968.20150417/include/rtw_debug.h:240:7: note: in expansion of macro ‘_seqdump’
    if(_seqdump(sel, fmt, ##arg)) /*rtw_warn_on(1)*/; \
       ^
/home/ubuntu/rtl8188EUS_linux_v4.3.0.8_13968.20150417/core/rtw_debug.c:1268:5: note: in expansion of macro ‘DBG_871X_SEL_NL’
     DBG_871X_SEL_NL(m, "agg_enable_bitmap=%x, candidate_tid_bitmap=%x\n", psta-
     ^
/home/ubuntu/rtl8188EUS_linux_v4.3.0.8_13968.20150417/include/rtw_debug.h:187:19: error: void value not ignored as it ought to be
  #define _seqdump seq_printf
                   ^
/home/ubuntu/rtl8188EUS_linux_v4.3.0.8_13968.20150417/include/rtw_debug.h:240:7: note: in expansion of macro ‘_seqdump’
    if(_seqdump(sel, fmt, ##arg)) /*rtw_warn_on(1)*/; \
       ^
/home/ubuntu/rtl8188EUS_linux_v4.3.0.8_13968.20150417/core/rtw_debug.c:1270:5: note: in expansion of macro ‘DBG_871X_SEL_NL’
     DBG_871X_SEL_NL(m, "sleepq_len=%d\n", psta->sleepq_len);
     ^
/home/ubuntu/rtl8188EUS_linux_v4.3.0.8_13968.20150417/include/rtw_debug.h:187:19: error: void value not ignored as it ought to be
  #define _seqdump seq_printf
                   ^
/home/ubuntu/rtl8188EUS_linux_v4.3.0.8_13968.20150417/include/rtw_debug.h:240:7: note: in expansion of macro ‘_seqdump’
    if(_seqdump(sel, fmt, ##arg)) /*rtw_warn_on(1)*/; \
       ^
/home/ubuntu/rtl8188EUS_linux_v4.3.0.8_13968.20150417/core/rtw_debug.c:1271:5: note: in expansion of macro ‘DBG_871X_SEL_NL’
     DBG_871X_SEL_NL(m, "capability=0x%x\n", psta->capability);
     ^
/home/ubuntu/rtl8188EUS_linux_v4.3.0.8_13968.20150417/include/rtw_debug.h:187:19: error: void value not ignored as it ought to be
  #define _seqdump seq_printf
                   ^
/home/ubuntu/rtl8188EUS_linux_v4.3.0.8_13968.20150417/include/rtw_debug.h:240:7: note: in expansion of macro ‘_seqdump’
    if(_seqdump(sel, fmt, ##arg)) /*rtw_warn_on(1)*/; \
       ^
/home/ubuntu/rtl8188EUS_linux_v4.3.0.8_13968.20150417/core/rtw_debug.c:1272:5: note: in expansion of macro ‘DBG_871X_SEL_NL’
     DBG_871X_SEL_NL(m, "flags=0x%x\n", psta->flags);
     ^
/home/ubuntu/rtl8188EUS_linux_v4.3.0.8_13968.20150417/include/rtw_debug.h:187:19: error: void value not ignored as it ought to be
  #define _seqdump seq_printf
                   ^
/home/ubuntu/rtl8188EUS_linux_v4.3.0.8_13968.20150417/include/rtw_debug.h:240:7: note: in expansion of macro ‘_seqdump’
    if(_seqdump(sel, fmt, ##arg)) /*rtw_warn_on(1)*/; \
       ^
/home/ubuntu/rtl8188EUS_linux_v4.3.0.8_13968.20150417/core/rtw_debug.c:1273:5: note: in expansion of macro ‘DBG_871X_SEL_NL’
     DBG_871X_SEL_NL(m, "wpa_psk=0x%x\n", psta->wpa_psk);
     ^
/home/ubuntu/rtl8188EUS_linux_v4.3.0.8_13968.20150417/include/rtw_debug.h:187:19: error: void value not ignored as it ought to be
  #define _seqdump seq_printf
                   ^
/home/ubuntu/rtl8188EUS_linux_v4.3.0.8_13968.20150417/include/rtw_debug.h:240:7: note: in expansion of macro ‘_seqdump’
    if(_seqdump(sel, fmt, ##arg)) /*rtw_warn_on(1)*/; \
       ^
/home/ubuntu/rtl8188EUS_linux_v4.3.0.8_13968.20150417/core/rtw_debug.c:1274:5: note: in expansion of macro ‘DBG_871X_SEL_NL’
     DBG_871X_SEL_NL(m, "wpa2_group_cipher=0x%x\n", psta->wpa2_group_cipher);
     ^
/home/ubuntu/rtl8188EUS_linux_v4.3.0.8_13968.20150417/include/rtw_debug.h:187:19: error: void value not ignored as it ought to be
  #define _seqdump seq_printf
                   ^
/home/ubuntu/rtl8188EUS_linux_v4.3.0.8_13968.20150417/include/rtw_debug.h:240:7: note: in expansion of macro ‘_seqdump’
    if(_seqdump(sel, fmt, ##arg)) /*rtw_warn_on(1)*/; \
       ^
/home/ubuntu/rtl8188EUS_linux_v4.3.0.8_13968.20150417/core/rtw_debug.c:1275:5: note: in expansion of macro ‘DBG_871X_SEL_NL’
     DBG_871X_SEL_NL(m, "wpa2_pairwise_cipher=0x%x\n", psta->wpa2_pairwise_ciphe
     ^
/home/ubuntu/rtl8188EUS_linux_v4.3.0.8_13968.20150417/include/rtw_debug.h:187:19: error: void value not ignored as it ought to be
  #define _seqdump seq_printf
                   ^
/home/ubuntu/rtl8188EUS_linux_v4.3.0.8_13968.20150417/include/rtw_debug.h:240:7: note: in expansion of macro ‘_seqdump’
    if(_seqdump(sel, fmt, ##arg)) /*rtw_warn_on(1)*/; \
       ^
/home/ubuntu/rtl8188EUS_linux_v4.3.0.8_13968.20150417/core/rtw_debug.c:1276:5: note: in expansion of macro ‘DBG_871X_SEL_NL’
     DBG_871X_SEL_NL(m, "qos_info=0x%x\n", psta->qos_info);
     ^
/home/ubuntu/rtl8188EUS_linux_v4.3.0.8_13968.20150417/include/rtw_debug.h:187:19: error: void value not ignored as it ought to be
  #define _seqdump seq_printf
                   ^
/home/ubuntu/rtl8188EUS_linux_v4.3.0.8_13968.20150417/include/rtw_debug.h:240:7: note: in expansion of macro ‘_seqdump’
    if(_seqdump(sel, fmt, ##arg)) /*rtw_warn_on(1)*/; \
       ^
/home/ubuntu/rtl8188EUS_linux_v4.3.0.8_13968.20150417/core/rtw_debug.c:1277:5: note: in expansion of macro ‘DBG_871X_SEL_NL’
     DBG_871X_SEL_NL(m, "dot118021XPrivacy=0x%x\n", psta->dot118021XPrivacy);
     ^
/home/ubuntu/rtl8188EUS_linux_v4.3.0.8_13968.20150417/include/rtw_debug.h:187:19: error: void value not ignored as it ought to be
  #define _seqdump seq_printf
                   ^
/home/ubuntu/rtl8188EUS_linux_v4.3.0.8_13968.20150417/include/rtw_debug.h:240:7: note: in expansion of macro ‘_seqdump’
    if(_seqdump(sel, fmt, ##arg)) /*rtw_warn_on(1)*/; \
       ^
/home/ubuntu/rtl8188EUS_linux_v4.3.0.8_13968.20150417/core/rtw_debug.c:1284:7: note: in expansion of macro ‘DBG_871X_SEL_NL’
       DBG_871X_SEL_NL(m, "tid=%d, indicate_seq=%d\n", j, preorder_ctrl->indicat
       ^
/home/ubuntu/rtl8188EUS_linux_v4.3.0.8_13968.20150417/include/rtw_debug.h:187:19: error: void value not ignored as it ought to be
  #define _seqdump seq_printf
                   ^
/home/ubuntu/rtl8188EUS_linux_v4.3.0.8_13968.20150417/include/rtw_debug.h:240:7: note: in expansion of macro ‘_seqdump’
    if(_seqdump(sel, fmt, ##arg)) /*rtw_warn_on(1)*/; \
       ^
/home/ubuntu/rtl8188EUS_linux_v4.3.0.8_13968.20150417/core/rtw_debug.c:1296:5: note: in expansion of macro ‘DBG_871X_SEL_NL’
     DBG_871X_SEL_NL(m, "==============================\n");
     ^
/home/ubuntu/rtl8188EUS_linux_v4.3.0.8_13968.20150417/core/rtw_debug.c: In function ‘proc_get_best_channel’:
/home/ubuntu/rtl8188EUS_linux_v4.3.0.8_13968.20150417/include/rtw_debug.h:187:19: error: void value not ignored as it ought to be
  #define _seqdump seq_printf
                   ^
/home/ubuntu/rtl8188EUS_linux_v4.3.0.8_13968.20150417/include/rtw_debug.h:240:7: note: in expansion of macro ‘_seqdump’
    if(_seqdump(sel, fmt, ##arg)) /*rtw_warn_on(1)*/; \
       ^
/home/ubuntu/rtl8188EUS_linux_v4.3.0.8_13968.20150417/core/rtw_debug.c:1369:3: note: in expansion of macro ‘DBG_871X_SEL_NL’
   DBG_871X_SEL_NL(m, "The rx cnt of channel %3d = %d\n", 
   ^
/home/ubuntu/rtl8188EUS_linux_v4.3.0.8_13968.20150417/include/rtw_debug.h:187:19: error: void value not ignored as it ought to be
  #define _seqdump seq_printf
                   ^
/home/ubuntu/rtl8188EUS_linux_v4.3.0.8_13968.20150417/include/rtw_debug.h:240:7: note: in expansion of macro ‘_seqdump’
    if(_seqdump(sel, fmt, ##arg)) /*rtw_warn_on(1)*/; \
       ^
/home/ubuntu/rtl8188EUS_linux_v4.3.0.8_13968.20150417/core/rtw_debug.c:1374:2: note: in expansion of macro ‘DBG_871X_SEL_NL’
  DBG_871X_SEL_NL(m, "best_channel_5G = %d\n", best_channel_5G);
  ^
/home/ubuntu/rtl8188EUS_linux_v4.3.0.8_13968.20150417/include/rtw_debug.h:187:19: error: void value not ignored as it ought to be
  #define _seqdump seq_printf
                   ^
/home/ubuntu/rtl8188EUS_linux_v4.3.0.8_13968.20150417/include/rtw_debug.h:240:7: note: in expansion of macro ‘_seqdump’
    if(_seqdump(sel, fmt, ##arg)) /*rtw_warn_on(1)*/; \
       ^
/home/ubuntu/rtl8188EUS_linux_v4.3.0.8_13968.20150417/core/rtw_debug.c:1375:2: note: in expansion of macro ‘DBG_871X_SEL_NL’
  DBG_871X_SEL_NL(m, "best_channel_24G = %d\n", best_channel_24G);
  ^
/home/ubuntu/rtl8188EUS_linux_v4.3.0.8_13968.20150417/core/rtw_debug.c: In function ‘proc_get_monitor’:
/home/ubuntu/rtl8188EUS_linux_v4.3.0.8_13968.20150417/include/rtw_debug.h:187:19: error: void value not ignored as it ought to be
  #define _seqdump seq_printf
                   ^
/home/ubuntu/rtl8188EUS_linux_v4.3.0.8_13968.20150417/include/rtw_debug.h:240:7: note: in expansion of macro ‘_seqdump’
    if(_seqdump(sel, fmt, ##arg)) /*rtw_warn_on(1)*/; \
       ^
/home/ubuntu/rtl8188EUS_linux_v4.3.0.8_13968.20150417/core/rtw_debug.c:1551:3: note: in expansion of macro ‘DBG_871X_SEL_NL’
   DBG_871X_SEL_NL(m, "Monitor mode : Enable\n");
   ^
/home/ubuntu/rtl8188EUS_linux_v4.3.0.8_13968.20150417/include/rtw_debug.h:187:19: error: void value not ignored as it ought to be
  #define _seqdump seq_printf
                   ^
/home/ubuntu/rtl8188EUS_linux_v4.3.0.8_13968.20150417/include/rtw_debug.h:240:7: note: in expansion of macro ‘_seqdump’
    if(_seqdump(sel, fmt, ##arg)) /*rtw_warn_on(1)*/; \
       ^
/home/ubuntu/rtl8188EUS_linux_v4.3.0.8_13968.20150417/core/rtw_debug.c:1553:3: note: in expansion of macro ‘DBG_871X_SEL_NL’
   DBG_871X_SEL_NL(m, "ch=%d, ch_offset=%d, bw=%d\n",
   ^
/home/ubuntu/rtl8188EUS_linux_v4.3.0.8_13968.20150417/include/rtw_debug.h:187:19: error: void value not ignored as it ought to be
  #define _seqdump seq_printf
                   ^
/home/ubuntu/rtl8188EUS_linux_v4.3.0.8_13968.20150417/include/rtw_debug.h:240:7: note: in expansion of macro ‘_seqdump’
    if(_seqdump(sel, fmt, ##arg)) /*rtw_warn_on(1)*/; \
       ^
/home/ubuntu/rtl8188EUS_linux_v4.3.0.8_13968.20150417/core/rtw_debug.c:1556:3: note: in expansion of macro ‘DBG_871X_SEL_NL’
   DBG_871X_SEL_NL(m, "Monitor mode : Disable\n");
   ^
cc1: some warnings being treated as errors
scripts/Makefile.build:294 : la recette pour la cible « /home/ubuntu/rtl8188EUS_linux_v4.3.0.8_13968.20150417/core/rtw_debug.o » a échouée
make[2]: *** [/home/ubuntu/rtl8188EUS_linux_v4.3.0.8_13968.20150417/core/rtw_debug.o] Erreur 1
Makefile:1524 : la recette pour la cible « _module_/home/ubuntu/rtl8188EUS_linux_v4.3.0.8_13968.20150417 » a échouée
make[1]: *** [_module_/home/ubuntu/rtl8188EUS_linux_v4.3.0.8_13968.20150417] Erreur 2
make[1] : on quitte le répertoire « /usr/src/linux-headers-4.10.0-28-generic »
Makefile:1367 : la recette pour la cible « modules » a échouée
make: *** [modules] Erreur 2
ubuntu@ubuntu:~/rtl8188EUS_linux_v4.3.0.8_13968.20150417$ sudo make install
"******************************************"
"NO SKRC,we will use default KSRC"
"******************************************"
install -p -m 644 8188eu.ko  /lib/modules/4.10.0-28-generic/kernel/drivers/net/wireless/
install: impossible d'évaluer '8188eu.ko': Aucun fichier ou dossier de ce type
Makefile:1373 : la recette pour la cible « install » a échouée
make: *** [install] Erreur 1
ubuntu@ubuntu:~/rtl8188EUS_linux_v4.3.0.8_13968.20150417$ 

Hors ligne

#9 Le 13/09/2017, à 06:26

xubu1957

Re : clé wifi tl-wn722n v2 sur ubuntu 16.04.3 TLS non reconnu ?

Bonjour,

ID 2357:010c  

la clé est détectée.

4.10.0-28-generic

le noyau n'est pas le dernier sorti au vu de linux-headers-generic.

Tente en filaire :

sudo apt update
sudo apt full-upgrade

Rajout -J'ai lu aussi :

le 27/04/2017, PIXLDealer a écrit :

Après moult tutoriels, aides de votre part, de forum anglais, espagnol et même russe, je n'ai pas la solution.

Merci à ceux qui m'ont aidé, ma Raspberry trouvera une autre clef.

Un conseil :
N'achetez pas de dongle chez ****(edit= rectifié) si vous êtes sur Linux.

dans -probleme-detection-carte-wi-fi-tl-wn722n

lsusb 
Bus 001 Device 005: ID 2357:010c 

Dernière modification par xubu1957 (Le 14/09/2017, à 15:42)


Important : Pensez à passer vos sujets en [Résolu] lorsque ceux-ci le sont, au début du titre en cliquant sur Modifier sous le premier message, et un bref récapitulatif de la solution à la fin de celui-ci. Merci.

Xubuntu 16.04.1 LTS : Lenovo T410 - Aspire 9411ASWI - HP 7100 DC - Asus 1015BX -Fujitsu Siemens Scaleo J3000  Membre de : Linux-Azur

Hors ligne

#10 Le 13/09/2017, à 21:51

stephanie77500

Re : clé wifi tl-wn722n v2 sur ubuntu 16.04.3 TLS non reconnu ?

salut xubu,

je te remercie de ton aide ,apparament cette clé n'est pas compatible j'ai du faire une erreur lors de ma commande (achat) cool pourtant il me semblait bien avoir lu sur le net que cette clé etait l'une des meilleur pour la penetration chez linux,cela n'est pas génant parcontre aurait tu une idée sur une clé qui pourrait etre reconnu facilement par ubuntu et kali?:rolleyes: mes logiciels de travaille serait aircrack-ng etc....

merci

Hors ligne

#11 Le 13/09/2017, à 22:03

xubu1957

Re : clé wifi tl-wn722n v2 sur ubuntu 16.04.3 TLS non reconnu ?

Une TP LINK TL-WN823N ?

Pour du noyau 4.4 :

Le 01/02/2017, au message # 4, cqfd93 a écrit :

Bonjour,

Je viens de réussir à faire fonctionner un adaptateur USB TP-LINK wn823n sur ma 14.04.5 (noyau 4.4.0-59).

Après avoir ratissé le web et essayé plein de choses, je suis tombée sur ce ppa :

sudo add-apt-repository ppa:hanipouspilot/rtlwifi
sudo apt update
sudo apt install rtl8192eu-dkms

Mais ça ne marchait toujours pas (l'adaptateur n'était pas détecté).

Et je suis finalement tombée sur cette page Packages in “Realtek wireless” sur laquelle j'ai trouvé rtl8192eu-dkms_4.4_all.deb et après reboot, bingo ! smile smile smile

et pour du noyau 4.8 :

Le 20/04/2017, au message # 10, samguili a écrit :

Bonjour,
une petite contribution pour le fonctionnement de cette clé wifi. Pour ma part, je dispose de la V2 :

ID 2357:0109

et je suis sur xubuntu 16.04.2, noyau 4.8.
L'info la plus utile pour moi a été donnée par Malah en #3 : le lien vers le github utilisé sur l'AUR soit https://github.com/Mange/rtl8192eu-linux-driver
En consultant la page d'accueil, j'ai pu faire reconnaître cette clé. La procédure que j'ai suivie :

sudo apt update
sudo apt upgrade
sudo apt-get install git linux-headers-generic build-essential dkms
git clone https://github.com/Mange/rtl8192eu-linux-driver
sudo dkms install rtl8192eu-linux-driver

Un redémarrage et la clé était fonctionnelle. Pour info, le git clone n'est pas obligatoire, il est également possible de télécharger l'archive, de la décompresser et de lancer la dernière commande. Cela dit, le clonage est plus pratique.

bon vent !

depuis ce fil : dongle usb wifi TL-WN823N

proposé dans RésoIu Installer dongle TP LINK TL-WN823N avec Ubuntu 16.04


Important : Pensez à passer vos sujets en [Résolu] lorsque ceux-ci le sont, au début du titre en cliquant sur Modifier sous le premier message, et un bref récapitulatif de la solution à la fin de celui-ci. Merci.

Xubuntu 16.04.1 LTS : Lenovo T410 - Aspire 9411ASWI - HP 7100 DC - Asus 1015BX -Fujitsu Siemens Scaleo J3000  Membre de : Linux-Azur

Hors ligne

#12 Le 13/09/2017, à 23:16

stephanie77500

Re : clé wifi tl-wn722n v2 sur ubuntu 16.04.3 TLS non reconnu ?

je ne sais pas si les pilotes son possible pour des réferences presque similaire la mienne et une » clé wifi tl-wn722n v2,
mais je vais y jeté un oeil ou c'est jamais jte tiens au courant .

merci

bonne nuit

Hors ligne

#13 Le 14/09/2017, à 06:30

xubu1957

Re : clé wifi tl-wn722n v2 sur ubuntu 16.04.3 TLS non reconnu ?

Bonjour,

La Doc WifiDocs/WirelessCardsSupported date un peu :

WifiDocs/WirelessCardsByVersion (WifiDocs/WirelessCardsSupported (dernière édition le 2015-04-20 03:46:51 par penalvch)


Important : Pensez à passer vos sujets en [Résolu] lorsque ceux-ci le sont, au début du titre en cliquant sur Modifier sous le premier message, et un bref récapitulatif de la solution à la fin de celui-ci. Merci.

Xubuntu 16.04.1 LTS : Lenovo T410 - Aspire 9411ASWI - HP 7100 DC - Asus 1015BX -Fujitsu Siemens Scaleo J3000  Membre de : Linux-Azur

Hors ligne

#14 Le 14/09/2017, à 08:47

moko138

Re : clé wifi tl-wn722n v2 sur ubuntu 16.04.3 TLS non reconnu ?

le 27/04/2017, PIXLDealer a écrit :

Un conseil :
    N'achetez pas de dongle chez [ici une marque] si vous êtes sur Linux.

Ce genre de généralisation me semble absurde, doublement :
- Pour une marque donnée, on trouve des clefs wifi bien prises en charge par tel ou tel noyau Linux, d'autres mal prises en charge ;
- La marque ne compte pas ; ce qui importe, c'est la puce, indiquée soit par lsusb, soit par lspci.

Pour ma part, j'ai une clef wifi de la marque en question, qui, depuis 12.04 au moins, est parfaitement prise en charge par tous les noyaux, d'emblée, sans aucune manip' ; (puce Atheros, driver ath9k_htc).
Mais il existe aussi d'autres puces Atheros qui, elles, sont moins bien prises en charge.

Notre Doc a une page détaillée sur les cartes wifi, alors de grâce, pas de généralisation.

Merci !


%NOINDEX%
Un utilitaire méconnu : ncdu

En ligne

#15 Le 14/09/2017, à 15:50

xubu1957

Re : clé wifi tl-wn722n v2 sur ubuntu 16.04.3 TLS non reconnu ?

@ moko138

Bonjour,

J'avais repris la citation dans son intégralité (déformation professionnelle, au titre du contradictoire tongue), mais c'était pour la partie de la réponse relative à une recherche infructueuse pour intégrer le pilote wifi.

Après moult tutoriels, aides de votre part, de forum anglais, espagnol et même russe, je n'ai pas la solution.
...

La problématique, au fil des versions et des matériels, n'étant pas le cœur de la discussion.


Important : Pensez à passer vos sujets en [Résolu] lorsque ceux-ci le sont, au début du titre en cliquant sur Modifier sous le premier message, et un bref récapitulatif de la solution à la fin de celui-ci. Merci.

Xubuntu 16.04.1 LTS : Lenovo T410 - Aspire 9411ASWI - HP 7100 DC - Asus 1015BX -Fujitsu Siemens Scaleo J3000  Membre de : Linux-Azur

Hors ligne

#16 Le 14/09/2017, à 21:45

xubu1957

Re : clé wifi tl-wn722n v2 sur ubuntu 16.04.3 TLS non reconnu ?

Bonjour,

J'ai retrouvé Tuto installation TP-LINK TL-WN722N-V2

et cette remarque :

au post #4, cqfd93 a écrit :

Bonjour,

Attention !!! On est sur Ubuntu, alors un CDROM Debian, ça ne va sûrement pas le faire !


Important : Pensez à passer vos sujets en [Résolu] lorsque ceux-ci le sont, au début du titre en cliquant sur Modifier sous le premier message, et un bref récapitulatif de la solution à la fin de celui-ci. Merci.

Xubuntu 16.04.1 LTS : Lenovo T410 - Aspire 9411ASWI - HP 7100 DC - Asus 1015BX -Fujitsu Siemens Scaleo J3000  Membre de : Linux-Azur

Hors ligne

#17 Le 15/09/2017, à 20:45

stephanie77500

Re : clé wifi tl-wn722n v2 sur ubuntu 16.04.3 TLS non reconnu ?

salut !

moko je ne génèralise pas,je dit juste que  cela va faire un mois que je cherche et que divers site anglais etc personne n'a trouver ,
si tu as trouvé tu as surement une clé meme réference mais la V1 qui elle et reconnu automatiquement,
je reprend les recherches dans l'espoir on c'est jamais big_smile

Hors ligne

#18 Le 16/09/2017, à 23:34

stephanie77500

Re : clé wifi tl-wn722n v2 sur ubuntu 16.04.3 TLS non reconnu ?

up

Hors ligne

#19 Le 17/09/2017, à 06:03

xubu1957

Re : clé wifi tl-wn722n v2 sur ubuntu 16.04.3 TLS non reconnu ?

Bonjour,

Tu as regardé le lien dans le message #16 ?

Dans cette discussion de l'année 2016 : [résolu] Wifi intermitant HP Envy M6 - Ralink RT3290, je donnais l'avis d'un membre dévoué de notre forum :

Le 28/08/2016, Coeur Noir a écrit :

ralink, ralink, ralink… j'ai 2 chipsets wifi ralink qui ont parfaitement fonctionné d'Ubuntu 8.04 à 13.04, sans rien faire de spécial, directement out of the box…

Mais depuis 13.10 plus moyen de les faire fonctionner (1), les drivers fournis sur les cd sont prévus pour des noyaux linux 2.6.x et il faut les compiler. Je n'ai pour l'instant trouvé personne qui ait réussi cet exploit… mais qui sait https://www.qwant.com/?q=ubuntu%20ralink&t=web ?
(1) ==> (edit= voir [Résolu] Connexion intermittente avec carte WI-FI Ralink RT2500)


Mon conseil de fainéant, et coûteux en plus : acheter si possible un autre dongle wifi 100% compatible linux pour une douzaine d'euros, ce sera bien plus simple → http://www.linux-hardware-guide.com/fr/tag/wifi ( bien lire les commentaires sur chaque matériel, ils précisent les éventuelles manip's à faire, choisir un matériel où tout va bien tout de suite sans rien installer, il y en a ! )

Si ta clé actuelle ne fonctionne pas, il faut la remplacer.


Rajout

Le 27/04/2017, wildmanne39 a écrit :

If you can I would return the TP-Link.
Si vous le permettez, je retournerais le TP-Link.

dans [SOLVED] TP-Link ACWireless Dual Band USB Adapter

Dernière modification par xubu1957 (Le 17/09/2017, à 06:35)


Important : Pensez à passer vos sujets en [Résolu] lorsque ceux-ci le sont, au début du titre en cliquant sur Modifier sous le premier message, et un bref récapitulatif de la solution à la fin de celui-ci. Merci.

Xubuntu 16.04.1 LTS : Lenovo T410 - Aspire 9411ASWI - HP 7100 DC - Asus 1015BX -Fujitsu Siemens Scaleo J3000  Membre de : Linux-Azur

Hors ligne

#20 Le 17/09/2017, à 10:15

stephanie77500

Re : clé wifi tl-wn722n v2 sur ubuntu 16.04.3 TLS non reconnu ?

merci xubu1957 pour ton aide,

je vais racheté une clé Awus036NH compatible linux j'ai trouver celle-ci qui apparament travaille bien avec virtual box,

au bout de 20 jours de recherches je baisse les bras roll

https://www.kali-linux.fr/cartes-wifi-compatibles

merci toute meme et bon week-end

Hors ligne