Contenu | Rechercher | Menus

Annonce

L'équipe des administrateurs et modérateurs du forum vous invite à prendre connaissance des nouvelles règles.
En cas de besoin, vous pouvez intervenir dans cette discussion.

Ubuntu 18.04 LTS
Ubuntu-fr propose des clés USB de Ubuntu et toutes ses « saveurs » ainsi qu'un magnifique t-shirt pour cette toute nouvelle version d'Ubuntu !

Si vous avez des soucis pour rester connecté, déconnectez-vous puis reconnectez-vous depuis ce lien en cochant la case
Me connecter automatiquement lors de mes prochaines visites.

À propos de l'équipe du forum.

#1 Le 09/08/2018, à 17:46

Reg22560

[Résolu] erreur de compilation du pilote RTL8822BE

Bonjour,
Je viens de faire d'acheter un PC avec la carte wifi RTL8822BE, elle n'ai pas reconnu avec la distrib 18.04.1 LTS

je viens taper les commandes de Naziel, j'ai l'erreur suivante:
ustine@justine-X405UAP:~/rtlwifi-next$ make
make -C /lib/modules/4.15.0-30-generic/build M=/home/justine/rtlwifi-next modules
make[1] : on entre dans le répertoire « /usr/src/linux-headers-4.15.0-30-generic »
Makefile:976: "Cannot use CONFIG_STACK_VALIDATION=y, please install libelf-dev, libelf-devel or elfutils-libelf-devel"
  CC [M]  /home/justine/rtlwifi-next/base.o
/home/justine/rtlwifi-next/base.c: In function ‘_rtl_init_deferred_work’:
/home/justine/rtlwifi-next/base.c:460:2: error: implicit declaration of function ‘setup_timer’; did you mean ‘sk_stop_timer’? [-Werror=implicit-function-declaration]
  setup_timer(&rtlpriv->works.watchdog_timer,
  ^~~~~~~~~~~
  sk_stop_timer
cc1: some warnings being treated as errors
scripts/Makefile.build:332: recipe for target '/home/justine/rtlwifi-next/base.o' failed
make[2]: *** [/home/justine/rtlwifi-next/base.o] Error 1
Makefile:1552: recipe for target '_module_/home/justine/rtlwifi-next' failed
make[1]: *** [_module_/home/justine/rtlwifi-next] Error 2
make[1] : on quitte le répertoire « /usr/src/linux-headers-4.15.0-30-generic »
Makefile:100: recipe for target 'all' failed
make: *** [all] Error 2
justine@justine-X405UAP:~/rtlwifi-next$ sudo make
make -C /lib/modules/4.15.0-30-generic/build M=/home/justine/rtlwifi-next modules
make[1] : on entre dans le répertoire « /usr/src/linux-headers-4.15.0-30-generic »
Makefile:976: "Cannot use CONFIG_STACK_VALIDATION=y, please install libelf-dev, libelf-devel or elfutils-libelf-devel"
  CC [M]  /home/justine/rtlwifi-next/base.o
/home/justine/rtlwifi-next/base.c: In function ‘_rtl_init_deferred_work’:
/home/justine/rtlwifi-next/base.c:460:2: error: implicit declaration of function ‘setup_timer’; did you mean ‘sk_stop_timer’? [-Werror=implicit-function-declaration]
  setup_timer(&rtlpriv->works.watchdog_timer,
  ^~~~~~~~~~~
  sk_stop_timer
cc1: some warnings being treated as errors
scripts/Makefile.build:332: recipe for target '/home/justine/rtlwifi-next/base.o' failed
make[2]: *** [/home/justine/rtlwifi-next/base.o] Error 1
Makefile:1552: recipe for target '_module_/home/justine/rtlwifi-next' failed
make[1]: *** [_module_/home/justine/rtlwifi-next] Error 2
make[1] : on quitte le répertoire « /usr/src/linux-headers-4.15.0-30-generic »
Makefile:100: recipe for target 'all' failed
make: *** [all] Error 2


Merci d'avance de votre aide

Hors ligne

#2 Le 09/08/2018, à 17:50

NicoApi73

Re : [Résolu] erreur de compilation du pilote RTL8822BE

Bonjour,

Veux tu bien ouvrir un fil spécifique STP, nous viendrons t'aider dessus.

Merci

Hors ligne

#3 Le 09/08/2018, à 17:52

xubu1957

Re : [Résolu] erreur de compilation du pilote RTL8822BE

Bonjour,

@Reg22560

Regarde au § 2 et début du § 3 > [Tuto] Pas de Wi-fi ? Eléments importants à vérifier pour désactiver le secure-boot.

_ _ _

EDIT - Essaye avec ce pilote :

git clone https://github.com/lwfinger/rtlwifi_new.git
cd rtlwifi_new/
git checkout origin/extended -b extended
make
sudo make install

> [Résolu] Deconnexion Realtek 8822BE.

_ _ _

@NicoApi73

Je viens de demander la scission du fil à la modération.

Dernière modification par xubu1957 (Le 09/08/2018, à 20:38)


Important : Pensez à passer vos sujets en [Résolu] lorsque ceux-ci le sont, au début du titre en cliquant sur Modifier sous le premier message, et un bref récapitulatif de la solution à la fin de celui-ci. Merci.

Xubuntu 16.04.1 LTS : Lenovo T410 - Toshiba Satellite A300  Membre de Linux-Azur

Hors ligne

#4 Le 09/08/2018, à 20:35

Reg22560

Re : [Résolu] erreur de compilation du pilote RTL8822BE

Bonjour,

Merci xubu1957, plus d'erreur de compil, tout fonctionne maintenant !

Hors ligne

#5 Le 09/08/2018, à 20:38

xubu1957

Re : [Résolu] erreur de compilation du pilote RTL8822BE

Pour ajouter toi-même les balises code à ton message #64  #1 :

  • Cliquer sur  le lien « Modifier » en bas à droite du message

  • Sélectionner le texte

  • Cliquer sur le <> de l'éditeur de message

1530289742.png

comme indiqué dans le : Retour utilisable de commande

Dernière modification par xubu1957 (Le 11/08/2018, à 12:06)


Important : Pensez à passer vos sujets en [Résolu] lorsque ceux-ci le sont, au début du titre en cliquant sur Modifier sous le premier message, et un bref récapitulatif de la solution à la fin de celui-ci. Merci.

Xubuntu 16.04.1 LTS : Lenovo T410 - Toshiba Satellite A300  Membre de Linux-Azur

Hors ligne