Contenu | Rechercher | Menus

Annonce

Si vous rencontrez des soucis à rester connecté sur le forum (ou si vous avez perdu votre mot de passe) déconnectez-vous et reconnectez-vous depuis cette page, en cochant la case "Me connecter automatiquement lors de mes prochaines visites". Attention, le forum rencontre actuellement quelques difficultés. En cas d'erreur 502, il ne faut pas re-valider l'envoi d'un message ou l'ouverture d'une discussion, au risque de créer un doublon.

La section divers se réorganise ! De nouvelles sous-sections à venir. (plus d'infos + donner son avis)

#26 Le 29/06/2010, à 10:24

yohann

Re : uzbl une autre façon de naviguer

salut, moi aussi je me suis mis récement à uzbl+wmii et ça roxe.

juste un léger problème avec le script d'enregistrement des favoris:


#!/bin/sh

[ -d "${XDG_DATA_HOME:-$HOME/.local/share}/uzbl" ] || exit 1
file=${XDG_DATA_HOME:-$HOME/.local/share}/uzbl/bookmarks

which zenity &>/dev/null || exit 2
url=$6
# replace tabs, they are pointless in titles and we want to use tabs as delimiter.
title=$(echo "$7" | sed 's/\t/    /')
entry=`zenity --entry --text="Ajouter un favori. add tags after the '\t', separated by spaces" --entry-text="$url $title\t"`
exitstatus=$?
if [ $exitstatus -ne 0 ]; then exit $exitstatus; fi
url=`echo $entry | awk '{print $1}'`

# TODO: check if already exists, if so, and tags are different: ask if you want to replace tags
echo "$entry" >/dev/null #for some reason we need this.. don't ask me why
echo -e "$entry"  >> $file
true

une fenètre zenity s'ouvre bien, mais le echo -e "$entry" >> $file
n'écrit pas
$url $titre
dans $file mais plutôt
-e $url $titre

et du coup je ne peux pas utiliser les favoris.,
j'ai regardé le man de echo et il apparait que -e est une option pour conserver les tabulations, (utilisées comme séparateurs du fichier bookmark) mais aucune idée de pourquoi ce script ne prend pas le -e comme un option mais l'écrit comme une partie du echo.
quelqu'un d'autre rencontre ce pb?

PS: webkit et les textarea redimenssionnable c'est le pied pour ce genre de message ;-)


j.vachez, le génie du net | Soirées jeux sur Lyon | 441
++++++++++[>+++++++>++++++++++>+++<<<-]>++.>+.+++++++
..+++.>++.<<+++++++++++++++.>.+++.------.--------.>+.

Hors ligne

#27 Le 30/06/2010, à 16:54

Nicky_rr

Re : uzbl une autre façon de naviguer

Ouais, jusqu'à maintenant vu que j'ai rentré seulement deux trois favoris j'ai ouvert le fichier texte à la main.

Pareil pour le script des mots de passe, ça ne marche pas, j'ai modifié le fichier à la main.

Bref pour bien faire il faudrait refaire de zéro ce genre de petits scripts, ça doit pas être si compliqué, surtout le bookmark big_smile

Hors ligne

#28 Le 30/06/2010, à 19:18

helly

Re : uzbl une autre façon de naviguer

J'ai un peu modifié ce script si vous voulez, (faut juste pas mettre d'espaces dans le tag du favori)

#!/bin/sh

[ -d "${XDG_DATA_HOME:-$HOME/.local/share}/uzbl" ] || exit 1
file=${XDG_DATA_HOME:-$HOME/.local/share}/uzbl/bookmarks

which zenity &>/dev/null || exit 2

entry=`zenity --entry --text="Add bookmark. add tags after the '\t', separated by spaces" --entry-text="$6 $7\t"`
url=`echo $entry | awk '{print $1}'`

# TODO: check if already exists, if so, and tags are different: ask if you want to replace tags
echo "$entry" >/dev/null #for some reason we need this.. don't ask me why
echo "$entry" >> $file
#echo -e "$entry"  >> $file
true

Archlinux-wmii-dwb.
Un problème résolu ? Faites le savoir en mettant [résolu] à côté du titre de votre topic.
Un problème non résolu ? Faites le savoir en insultant ceux qui cherchent à vous aider.
Un site bleu super remasterised©, un wiki cherchant des volontaires pour traduire un site.

Hors ligne

#29 Le 08/07/2010, à 21:02

T_i_t_i

Re : uzbl une autre façon de naviguer

Salut tout le monde ! smile
Tiens helly, c'est trop drole, cet aprèm je cherchais un gestionnaire de fenêtres très léger au clavier. Je me suis mis à vim (au vu du nombre de personnes qui l'aiment, dont toi, ça m'a décidé à lacher gedit tongue -> http://forum.ubuntu-fr.org/viewtopic.php?pid=3542605 ) Il n'y a pas longtemps du tout et j'ai beaucoup aimé le concept du 100 % clavier...

j'avais cliqué il y a quelque temps sur ta signature, mais je ne savait plus le nom de wmii...
Pour le trouver, je recherche helly dans le fofo, et bingo ! voila, ce soir j'ai uzbl et wmii d'installé, c'est vraiment pas mal ! Merci beaucoup helly ^^ smile

Mais j'ai une petite question :
Le texte, on insert... Ca ça va ...
Mais pour remplir les cases ou il faut cliquer dessus avec la souris, on fait comment ?
captureft.png

D'avance merci !

Edit : a propos, je crois que je vais en profiter pour éditer le wiki de uzbl, pour rajouter quelques commandes bien utiles !

Dernière modification par T_i_t_i (Le 08/07/2010, à 21:13)


Ubuntu 10.04 / GNOME
(wmii),c'est bien, (uzbl),aussi (merci helly ^^)

Hors ligne

#30 Le 08/07/2010, à 21:59

helly

Re : uzbl une autre façon de naviguer

Pour les cases à remplir, soit tu triches avec la souris, soit tu passes en mode I puis tu fais des tabs pour arriver à la bonne case wink


Archlinux-wmii-dwb.
Un problème résolu ? Faites le savoir en mettant [résolu] à côté du titre de votre topic.
Un problème non résolu ? Faites le savoir en insultant ceux qui cherchent à vous aider.
Un site bleu super remasterised©, un wiki cherchant des volontaires pour traduire un site.

Hors ligne

#31 Le 08/07/2010, à 22:03

T_i_t_i

Re : uzbl une autre façon de naviguer

Oui, merci, pour les tabs il n'y a pas de problèmes, mais pour valider ça ne va pas.
Avec Tab : on clique entrée et ça marche, ici, quand on est sur la case, ça ne la coche pas quand on fait entrée, vraiment étrange...
Je suis en train de terminer les modifs sur le wiki de uzbl.


Ubuntu 10.04 / GNOME
(wmii),c'est bien, (uzbl),aussi (merci helly ^^)

Hors ligne

#32 Le 08/07/2010, à 22:06

helly

Re : uzbl une autre façon de naviguer

Pour cocher les case (j'ai pas d'exemple pour tester sous la main…) je crois qu'il faut se mettre dessus et faire ESPACE


Archlinux-wmii-dwb.
Un problème résolu ? Faites le savoir en mettant [résolu] à côté du titre de votre topic.
Un problème non résolu ? Faites le savoir en insultant ceux qui cherchent à vous aider.
Un site bleu super remasterised©, un wiki cherchant des volontaires pour traduire un site.

Hors ligne

#33 Le 08/07/2010, à 22:07

T_i_t_i

Re : uzbl une autre façon de naviguer

Je teste ça de suite, mais espace il me semble que c'est pour descendre en bas de page ?
Je vais essayer ça.
wiki modifié.


Ubuntu 10.04 / GNOME
(wmii),c'est bien, (uzbl),aussi (merci helly ^^)

Hors ligne

#34 Le 08/07/2010, à 22:08

helly

Re : uzbl une autre façon de naviguer

(espace en mode I quand tu est sur la case à cocher, je viens de tester, ça marche bien : )


Archlinux-wmii-dwb.
Un problème résolu ? Faites le savoir en mettant [résolu] à côté du titre de votre topic.
Un problème non résolu ? Faites le savoir en insultant ceux qui cherchent à vous aider.
Un site bleu super remasterised©, un wiki cherchant des volontaires pour traduire un site.

Hors ligne

#35 Le 08/07/2010, à 22:10

T_i_t_i

Re : uzbl une autre façon de naviguer

Exaaaacte ! C'est espace ! merci helly ! smile
Bon... je modifies le wiki alors, parce que c'est un peu particulier...


Ubuntu 10.04 / GNOME
(wmii),c'est bien, (uzbl),aussi (merci helly ^^)

Hors ligne

#36 Le 08/07/2010, à 22:11

helly

Re : uzbl une autre façon de naviguer

Fais toi plaisir smile


Archlinux-wmii-dwb.
Un problème résolu ? Faites le savoir en mettant [résolu] à côté du titre de votre topic.
Un problème non résolu ? Faites le savoir en insultant ceux qui cherchent à vous aider.
Un site bleu super remasterised©, un wiki cherchant des volontaires pour traduire un site.

Hors ligne

#37 Le 26/07/2010, à 17:35

cbrunos

Re : uzbl une autre façon de naviguer

Salut, à tous! J'ai bien envie d'utiliser ce navigateur, mais je dois avouer que j'ai du mal à commencer…J'ai mis le script follow.js dans /home/cbrunos/.uzbl/scripts
et dans mon fichier de configuration de uzbl j'ai écrit:
set scripts_dir     = /home/cbrunos/.uzbl/scripts
et plus bas:
@cbind  fl*  = script @scripts_dir/follow.js %s
et pourtant quand je tape la combinaison fl rien ne se passe.
Qu'est-ce qui cloche?

Ps: j'utilise uzbl-tabbed, d'ailleurs comment le conifgurer?
Merci!

EDIT: Ok, j'ai trouvé un début de piste: j'ai fait un:

cp -r /usr/share/uzbl/examples/config/uzbl ~/.config/
cp -r /usr/share/uzbl/examples/data/uzbl ~/.local/share/

et j'ai déja pas mal de scripts.
Je dois juste modifier les touches pour mon clavier bépo, et je pense que ça ira…

Dernière modification par cbrunos (Le 26/07/2010, à 18:39)


Je recommande pcubuntoo!

Hors ligne

#38 Le 27/07/2010, à 17:46

cbrunos

Re : uzbl une autre façon de naviguer

Bon j'ai fini par abandonner parce que j'ai trouvé plus simple: Midori avec un script qui permet de bénéficier des raccourcis de vimperator.
Si ça intéresse qulequ'un https://bbs.archlinux.org/viewtopic.php?id=97645


Je recommande pcubuntoo!

Hors ligne

#39 Le 16/08/2010, à 21:50

Kyramud

Re : uzbl une autre façon de naviguer

Salut.

Suite à une installation minimale d'Ubuntu et d'Openbox sur un vieil ordinateur, j'ai voulu testé Uzbl. Si la version des dépots fonctionne correctement, je n'arrive pas à installer la version complète à partir des sources.  J'ai eu plusieurs problèmes lors du make, résolus en installant g++, et je sais plus quoi. Mais avec ce nouveau message d'erreur je suis perdu :

~/uzbl$ make
Package gtk+-2.0 was not found in the pkg-config search path.
Perhaps you should add the directory containing `gtk+-2.0.pc'
to the PKG_CONFIG_PATH environment variable
No package 'gtk+-2.0' found
Package webkit-1.0 was not found in the pkg-config search path.
Perhaps you should add the directory containing `webkit-1.0.pc'
to the PKG_CONFIG_PATH environment variable
No package 'webkit-1.0' found
Package libsoup-2.4 was not found in the pkg-config search path.
Perhaps you should add the directory containing `libsoup-2.4.pc'
to the PKG_CONFIG_PATH environment variable
No package 'libsoup-2.4' found
Package gthread-2.0 was not found in the pkg-config search path.
Perhaps you should add the directory containing `gthread-2.0.pc'
to the PKG_CONFIG_PATH environment variable
No package 'gthread-2.0' found
Package gtk+-2.0 was not found in the pkg-config search path.
Perhaps you should add the directory containing `gtk+-2.0.pc'
to the PKG_CONFIG_PATH environment variable
No package 'gtk+-2.0' found
Package webkit-1.0 was not found in the pkg-config search path.
Perhaps you should add the directory containing `webkit-1.0.pc'
to the PKG_CONFIG_PATH environment variable
No package 'webkit-1.0' found
Package libsoup-2.4 was not found in the pkg-config search path.
Perhaps you should add the directory containing `libsoup-2.4.pc'
to the PKG_CONFIG_PATH environment variable
No package 'libsoup-2.4' found
Package gthread-2.0 was not found in the pkg-config search path.
Perhaps you should add the directory containing `gthread-2.0.pc'
to the PKG_CONFIG_PATH environment variable
No package 'gthread-2.0' found
-e cc -c -std=c99  -ggdb -Wall -W -DARCH="i686" -lgthread-2.0 -DCOMMIT="9cc39cb5c9396be013b5dc2ba7e4b3eaa647e975"  -fPIC -W -Wall -Wextra -pedantic src/callbacks.c
In file included from src/callbacks.c:6:
src/uzbl-core.h:15:25: error: glib/gstdio.h: Aucun fichier ou dossier de ce type
src/uzbl-core.h:16:21: error: gtk/gtk.h: Aucun fichier ou dossier de ce type
src/uzbl-core.h:17:22: error: gdk/gdkx.h: Aucun fichier ou dossier de ce type
src/uzbl-core.h:18:28: error: gdk/gdkkeysyms.h: Aucun fichier ou dossier de ce type
src/uzbl-core.h:25:27: error: webkit/webkit.h: Aucun fichier ou dossier de ce type
src/uzbl-core.h:26:26: error: libsoup/soup.h: Aucun fichier ou dossier de ce type
src/uzbl-core.h:27:39: error: JavaScriptCore/JavaScript.h: Aucun fichier ou dossier de ce type
In file included from src/callbacks.c:6:
src/uzbl-core.h:47: error: expected specifier-qualifier-list before ‘GtkWidget’
src/uzbl-core.h:69: warning: struct has no members
src/uzbl-core.h:75: error: expected specifier-qualifier-list before ‘gchar’
src/uzbl-core.h:83: warning: struct has no members
src/uzbl-core.h:88: error: expected specifier-qualifier-list before ‘gchar’
src/uzbl-core.h:102: warning: struct has no members
src/uzbl-core.h:107: error: expected specifier-qualifier-list before ‘SoupSession’
src/uzbl-core.h:114: warning: struct has no members
src/uzbl-core.h:119: error: expected specifier-qualifier-list before ‘gchar’
src/uzbl-core.h:170: warning: struct has no members
src/uzbl-core.h:174: error: expected specifier-qualifier-list before ‘gboolean’
src/uzbl-core.h:177: warning: struct has no members
src/uzbl-core.h:184: error: expected specifier-qualifier-list before ‘gchar’
src/uzbl-core.h:199: error: expected specifier-qualifier-list before ‘Window’
src/uzbl-core.h:209: error: expected specifier-qualifier-list before ‘gchar’
src/uzbl-core.h:211: warning: struct has no members
src/uzbl-core.h:220: error: expected specifier-qualifier-list before ‘gchar’
src/uzbl-core.h:234: error: expected ‘=’, ‘,’, ‘;’, ‘asm’ or ‘__attribute__’ before ‘*’ token
src/uzbl-core.h:237: error: expected ‘=’, ‘,’, ‘;’, ‘asm’ or ‘__attribute__’ before ‘*’ token
src/uzbl-core.h:240: error: expected ‘=’, ‘,’, ‘;’, ‘asm’ or ‘__attribute__’ before ‘*’ token
src/uzbl-core.h:253: error: expected ‘=’, ‘,’, ‘;’, ‘asm’ or ‘__attribute__’ before ‘set_var_value’
src/uzbl-core.h:256: error: expected ‘)’ before ‘*’ token
src/uzbl-core.h:259: error: expected ‘)’ before ‘*’ token
src/uzbl-core.h:265: error: expected ‘=’, ‘,’, ‘;’, ‘asm’ or ‘__attribute__’ before ‘file_exists’
src/uzbl-core.h:268: error: expected ‘)’ before ‘*’ token
src/uzbl-core.h:271: error: expected ‘)’ before ‘*’ token
src/uzbl-core.h:274: error: expected ‘)’ before ‘*’ token
src/uzbl-core.h:277: error: expected ‘=’, ‘,’, ‘;’, ‘asm’ or ‘__attribute__’ before ‘run_command’
src/uzbl-core.h:281: error: expected ‘)’ before ‘*’ token
src/uzbl-core.h:284: error: expected ‘)’ before ‘*’ token
src/uzbl-core.h:287: error: expected ‘)’ before ‘*’ token
src/uzbl-core.h:290: error: expected ‘)’ before ‘*’ token
src/uzbl-core.h:293: error: expected ‘)’ before ‘*’ token
src/uzbl-core.h:296: error: expected declaration specifiers or ‘...’ before ‘GString’
src/uzbl-core.h:299: error: expected declaration specifiers or ‘...’ before ‘GString’
src/uzbl-core.h:301: error: expected ‘=’, ‘,’, ‘;’, ‘asm’ or ‘__attribute__’ before ‘*’ token
src/uzbl-core.h:305: error: expected ‘=’, ‘,’, ‘;’, ‘asm’ or ‘__attribute__’ before ‘control_fifo’
src/uzbl-core.h:307: error: expected ‘=’, ‘,’, ‘;’, ‘asm’ or ‘__attribute__’ before ‘*’ token
src/uzbl-core.h:311: error: expected ‘=’, ‘,’, ‘;’, ‘asm’ or ‘__attribute__’ before ‘control_stdin’
src/uzbl-core.h:316: error: expected ‘=’, ‘,’, ‘;’, ‘asm’ or ‘__attribute__’ before ‘*’ token
src/uzbl-core.h:320: error: expected ‘=’, ‘,’, ‘;’, ‘asm’ or ‘__attribute__’ before ‘control_socket’
src/uzbl-core.h:323: error: expected ‘=’, ‘,’, ‘;’, ‘asm’ or ‘__attribute__’ before ‘control_client_socket’
src/uzbl-core.h:329: error: expected ‘=’, ‘,’, ‘;’, ‘asm’ or ‘__attribute__’ before ‘key_press_cb’
src/uzbl-core.h:332: error: expected ‘=’, ‘,’, ‘;’, ‘asm’ or ‘__attribute__’ before ‘key_release_cb’
src/uzbl-core.h:340: error: expected ‘=’, ‘,’, ‘;’, ‘asm’ or ‘__attribute__’ before ‘*’ token
src/uzbl-core.h:343: error: expected ‘=’, ‘,’, ‘;’, ‘asm’ or ‘__attribute__’ before ‘*’ token
src/uzbl-core.h:346: error: expected ‘=’, ‘,’, ‘;’, ‘asm’ or ‘__attribute__’ before ‘*’ token
src/uzbl-core.h:350: warning: type defaults to ‘int’ in declaration of ‘gchar’
src/uzbl-core.h:350: error: expected ‘;’, ‘,’ or ‘)’ before ‘*’ token
src/uzbl-core.h:352: error: expected ‘=’, ‘,’, ‘;’, ‘asm’ or ‘__attribute__’ before ‘*’ token
src/uzbl-core.h:355: error: expected ‘=’, ‘,’, ‘;’, ‘asm’ or ‘__attribute__’ before ‘*’ token
src/uzbl-core.h:362: error: expected ‘)’ before ‘*’ token
src/uzbl-core.h:365: error: expected ‘)’ before ‘*’ token
src/uzbl-core.h:368: error: expected ‘)’ before ‘*’ token
src/uzbl-core.h:371: error: expected ‘)’ before ‘*’ token
src/uzbl-core.h:374: error: expected ‘)’ before ‘*’ token
src/uzbl-core.h:377: error: expected ‘)’ before ‘*’ token
src/uzbl-core.h:380: error: expected ‘)’ before ‘*’ token
src/uzbl-core.h:383: error: expected ‘)’ before ‘*’ token
src/uzbl-core.h:386: error: expected ‘)’ before ‘*’ token
src/uzbl-core.h:392: error: expected ‘)’ before ‘*’ token
src/uzbl-core.h:397: error: expected ‘)’ before ‘*’ token
src/uzbl-core.h:406: error: expected ‘)’ before ‘k’
src/uzbl-core.h:409: error: expected ‘)’ before ‘k’
src/uzbl-core.h:421: error: expected ‘)’ before ‘*’ token
src/uzbl-core.h:427: error: expected ‘=’, ‘,’, ‘;’, ‘asm’ or ‘__attribute__’ before ‘remove_socket_from_array’
src/uzbl-core.h:430: error: expected ‘)’ before ‘*’ token
src/uzbl-core.h:433: error: expected ‘)’ before ‘*’ token
src/uzbl-core.h:436: error: expected ‘)’ before ‘*’ token
src/uzbl-core.h:439: error: expected ‘)’ before ‘*’ token
src/uzbl-core.h:442: error: expected ‘)’ before ‘*’ token
src/uzbl-core.h:445: error: expected ‘)’ before ‘*’ token
src/uzbl-core.h:448: error: expected ‘)’ before ‘*’ token
src/uzbl-core.h:451: error: expected ‘)’ before ‘*’ token
src/uzbl-core.h:454: error: expected ‘)’ before ‘*’ token
src/uzbl-core.h:457: error: expected ‘)’ before ‘*’ token
src/uzbl-core.h:460: error: expected ‘)’ before ‘*’ token
src/uzbl-core.h:463: error: expected ‘)’ before ‘*’ token
src/uzbl-core.h:466: error: expected ‘=’, ‘,’, ‘;’, ‘asm’ or ‘__attribute__’ before ‘get_click_context’
src/uzbl-core.h:469: error: expected ‘)’ before ‘*’ token
src/uzbl-core.h:472: error: expected ‘)’ before ‘*’ token
src/uzbl-core.h:477: error: expected ‘)’ before ‘*’ token
src/uzbl-core.h:480: error: expected specifier-qualifier-list before ‘Command’
src/uzbl-core.h:482: warning: struct has no members
src/uzbl-core.h:485: error: expected specifier-qualifier-list before ‘gchar’
src/uzbl-core.h:489: warning: struct has no members
In file included from src/callbacks.c:7:
src/callbacks.h:127: error: expected ‘=’, ‘,’, ‘;’, ‘asm’ or ‘__attribute__’ before ‘*’ token
src/callbacks.h:131: error: expected ‘=’, ‘,’, ‘;’, ‘asm’ or ‘__attribute__’ before ‘download_cb’
src/callbacks.h:134: error: expected ‘)’ before ‘*’ token
src/callbacks.h:137: error: expected ‘)’ before ‘*’ token
src/callbacks.h:140: error: expected ‘)’ before ‘*’ token
src/callbacks.h:143: error: expected ‘)’ before ‘*’ token
src/callbacks.h:146: error: expected ‘)’ before ‘*’ token
src/callbacks.h:149: error: expected ‘)’ before ‘*’ token
src/callbacks.h:152: error: expected ‘)’ before ‘*’ token
src/callbacks.h:155: error: expected ‘)’ before ‘*’ token
src/callbacks.h:158: error: expected ‘)’ before ‘*’ token
src/callbacks.h:161: error: expected ‘)’ before ‘*’ token
src/callbacks.h:164: error: expected ‘)’ before ‘*’ token
src/callbacks.h:167: error: expected ‘=’, ‘,’, ‘;’, ‘asm’ or ‘__attribute__’ before ‘configure_event_cb’
src/callbacks.h:170: error: expected ‘=’, ‘,’, ‘;’, ‘asm’ or ‘__attribute__’ before ‘key_press_cb’
src/callbacks.h:173: error: expected ‘=’, ‘,’, ‘;’, ‘asm’ or ‘__attribute__’ before ‘key_release_cb’
src/callbacks.h:176: error: expected ‘=’, ‘,’, ‘;’, ‘asm’ or ‘__attribute__’ before ‘motion_notify_cb’
src/callbacks.h:179: error: expected ‘=’, ‘,’, ‘;’, ‘asm’ or ‘__attribute__’ before ‘navigation_decision_cb’
src/callbacks.h:184: error: expected ‘=’, ‘,’, ‘;’, ‘asm’ or ‘__attribute__’ before ‘new_window_cb’
src/callbacks.h:189: error: expected ‘=’, ‘,’, ‘;’, ‘asm’ or ‘__attribute__’ before ‘mime_policy_cb’
src/callbacks.h:193: error: expected ‘)’ before ‘*’ token
src/callbacks.h:196: error: expected ‘=’, ‘,’, ‘;’, ‘asm’ or ‘__attribute__’ before ‘*’ token
src/callbacks.h:200: error: expected ‘=’, ‘,’, ‘;’, ‘asm’ or ‘__attribute__’ before ‘download_cb’
src/callbacks.h:203: error: expected ‘)’ before ‘*’ token
src/callbacks.h:206: error: expected ‘=’, ‘,’, ‘;’, ‘asm’ or ‘__attribute__’ before ‘button_press_cb’
src/callbacks.h:209: error: expected ‘=’, ‘,’, ‘;’, ‘asm’ or ‘__attribute__’ before ‘button_release_cb’
src/callbacks.h:212: error: expected ‘=’, ‘,’, ‘;’, ‘asm’ or ‘__attribute__’ before ‘focus_cb’
src/callbacks.h:215: error: expected ‘)’ before ‘*’ token
src/callbacks.h:218: error: expected ‘)’ before ‘*’ token
In file included from src/callbacks.c:8:
src/events.h:25: error: expected ‘)’ before ‘sec’
src/events.h:28: error: expected ‘)’ before ‘*’ token
src/events.h:31: error: expected ‘)’ before ‘*’ token
src/events.h:34: warning: type defaults to ‘int’ in declaration of ‘gchar’
src/events.h:34: error: expected ‘;’, ‘,’ or ‘)’ before ‘*’ token
src/events.h:37: error: expected ‘)’ before ‘keyval’
src/callbacks.c: In function ‘set_proxy_url’:
src/callbacks.c:13: error: ‘SoupURI’ undeclared (first use in this function)
src/callbacks.c:13: error: (Each undeclared identifier is reported only once
src/callbacks.c:13: error: for each function it appears in.)
src/callbacks.c:13: error: ‘suri’ undeclared (first use in this function)
src/callbacks.c:15: error: ‘Network’ has no member named ‘proxy_url’
src/callbacks.c:15: error: ‘Network’ has no member named ‘proxy_url’
src/callbacks.c:16: warning: implicit declaration of function ‘soup_session_remove_feature_by_type’
src/callbacks.c:16: error: ‘Network’ has no member named ‘soup_session’
src/callbacks.c:17: error: ‘GType’ undeclared (first use in this function)
src/callbacks.c:17: error: expected ‘)’ before ‘SOUP_SESSION_PROXY_URI’
src/callbacks.c:20: warning: implicit declaration of function ‘soup_uri_new’
src/callbacks.c:20: error: ‘Network’ has no member named ‘proxy_url’
src/callbacks.c:21: warning: implicit declaration of function ‘g_object_set’
src/callbacks.c:21: warning: implicit declaration of function ‘G_OBJECT’
src/callbacks.c:21: error: ‘Network’ has no member named ‘soup_session’
src/callbacks.c:22: error: ‘SOUP_SESSION_PROXY_URI’ undeclared (first use in this function)
src/callbacks.c:24: warning: implicit declaration of function ‘soup_uri_free’
src/callbacks.c: In function ‘set_authentication_handler’:
src/callbacks.c:32: error: ‘GSList’ undeclared (first use in this function)
src/callbacks.c:32: error: ‘flist’ undeclared (first use in this function)
src/callbacks.c:32: warning: implicit declaration of function ‘soup_session_get_features’
src/callbacks.c:32: error: ‘Network’ has no member named ‘soup_session’
src/callbacks.c:32: error: ‘GType’ undeclared (first use in this function)
src/callbacks.c:32: error: expected ‘)’ before ‘WEBKIT_TYPE_SOUP_AUTH_DIALOG’
src/callbacks.c:33: error: ‘guint’ undeclared (first use in this function)
src/callbacks.c:33: error: expected ‘;’ before ‘feature_is_set’
src/callbacks.c:34: warning: implicit declaration of function ‘g_slist_free’
src/callbacks.c:36: error: ‘Behaviour’ has no member named ‘authentication_handler’
src/callbacks.c:36: error: ‘Behaviour’ has no member named ‘authentication_handler’
src/callbacks.c:37: error: ‘feature_is_set’ undeclared (first use in this function)
src/callbacks.c:39: warning: implicit declaration of function ‘soup_session_add_feature_by_type’
src/callbacks.c:39: error: ‘Network’ has no member named ‘soup_session’
src/callbacks.c:39: error: expected ‘)’ before ‘WEBKIT_TYPE_SOUP_AUTH_DIALOG’
src/callbacks.c:43: error: ‘Network’ has no member named ‘soup_session’
src/callbacks.c:43: error: expected ‘)’ before ‘WEBKIT_TYPE_SOUP_AUTH_DIALOG’
src/callbacks.c: In function ‘set_icon’:
src/callbacks.c:50: warning: implicit declaration of function ‘file_exists’
src/callbacks.c:50: error: ‘GUI’ has no member named ‘icon’
src/callbacks.c:51: error: ‘GUI’ has no member named ‘main_window’
src/callbacks.c:52: warning: implicit declaration of function ‘gtk_window_set_icon_from_file’
src/callbacks.c:52: warning: implicit declaration of function ‘GTK_WINDOW’
src/callbacks.c:52: error: ‘GUI’ has no member named ‘main_window’
src/callbacks.c:52: error: ‘GUI’ has no member named ‘icon’
src/callbacks.c:54: warning: implicit declaration of function ‘g_printerr’
src/callbacks.c:54: error: ‘GUI’ has no member named ‘icon’
src/callbacks.c: In function ‘cmd_set_geometry’:
src/callbacks.c:62: error: ‘GUI’ has no member named ‘geometry’
src/callbacks.c:63: error: ‘GUI’ has no member named ‘geometry’
src/callbacks.c:64: warning: implicit declaration of function ‘gtk_window_maximize’
src/callbacks.c:64: error: ‘GtkWindow’ undeclared (first use in this function)
src/callbacks.c:64: error: expected expression before ‘)’ token
src/callbacks.c:64: error: ‘GUI’ has no member named ‘main_window’
src/callbacks.c:67: warning: implicit declaration of function ‘XParseGeometry’
src/callbacks.c:67: error: ‘GUI’ has no member named ‘geometry’
src/callbacks.c:68: error: ‘XValue’ undeclared (first use in this function)
src/callbacks.c:69: warning: implicit declaration of function ‘gtk_window_move’
src/callbacks.c:69: error: expected expression before ‘)’ token
src/callbacks.c:70: error: ‘WidthValue’ undeclared (first use in this function)
src/callbacks.c:71: warning: implicit declaration of function ‘gtk_window_resize’
src/callbacks.c:71: error: expected expression before ‘)’ token
src/callbacks.c: In function ‘cmd_set_status’:
src/callbacks.c:85: error: ‘Behaviour’ has no member named ‘show_status’
src/callbacks.c:86: warning: implicit declaration of function ‘gtk_widget_hide’
src/callbacks.c:86: error: ‘GUI’ has no member named ‘mainbar’
src/callbacks.c:88: warning: implicit declaration of function ‘gtk_widget_show’
src/callbacks.c:88: error: ‘GUI’ has no member named ‘mainbar’
src/callbacks.c: In function ‘cmd_load_uri’:
src/callbacks.c:95: warning: implicit declaration of function ‘load_uri_imp’
src/callbacks.c:95: error: ‘State’ has no member named ‘uri’
src/callbacks.c: In function ‘cmd_max_conns’:
src/callbacks.c:100: error: ‘Network’ has no member named ‘soup_session’
src/callbacks.c:101: error: ‘SOUP_SESSION_MAX_CONNS’ undeclared (first use in this function)
src/callbacks.c:101: error: ‘Network’ has no member named ‘max_conns’
src/callbacks.c: In function ‘cmd_max_conns_host’:
src/callbacks.c:106: error: ‘Network’ has no member named ‘soup_session’
src/callbacks.c:107: error: ‘SOUP_SESSION_MAX_CONNS_PER_HOST’ undeclared (first use in this function)
src/callbacks.c:107: error: ‘Network’ has no member named ‘max_conns_host’
src/callbacks.c: In function ‘cmd_http_debug’:
src/callbacks.c:113: warning: implicit declaration of function ‘soup_session_remove_feature’
src/callbacks.c:113: error: ‘Network’ has no member named ‘soup_session’
src/callbacks.c:113: warning: implicit declaration of function ‘SOUP_SESSION_FEATURE’
src/callbacks.c:113: error: ‘Network’ has no member named ‘soup_logger’
src/callbacks.c:117: error: ‘Network’ has no member named ‘soup_logger’
src/callbacks.c:117: warning: implicit declaration of function ‘soup_logger_new’
src/callbacks.c:117: error: ‘Behaviour’ has no member named ‘http_debug’
src/callbacks.c:118: warning: implicit declaration of function ‘soup_session_add_feature’
src/callbacks.c:118: error: ‘Network’ has no member named ‘soup_session’
src/callbacks.c:119: error: ‘Network’ has no member named ‘soup_logger’
src/callbacks.c: At top level:
src/callbacks.c:122: error: expected ‘=’, ‘,’, ‘;’, ‘asm’ or ‘__attribute__’ before ‘*’ token
src/callbacks.c: In function ‘cmd_font_size’:
src/callbacks.c:129: error: ‘WebKitWebSettings’ undeclared (first use in this function)
src/callbacks.c:129: error: ‘ws’ undeclared (first use in this function)
src/callbacks.c:129: warning: implicit declaration of function ‘view_settings’
src/callbacks.c:130: error: ‘Behaviour’ has no member named ‘font_size’
src/callbacks.c:131: error: ‘Behaviour’ has no member named ‘font_size’
src/callbacks.c:134: error: ‘Behaviour’ has no member named ‘monospace_size’
src/callbacks.c:136: error: ‘Behaviour’ has no member named ‘monospace_size’
src/callbacks.c:139: error: ‘Behaviour’ has no member named ‘font_size’
src/callbacks.c: In function ‘cmd_default_font_family’:
src/callbacks.c:146: error: ‘Behaviour’ has no member named ‘default_font_family’
src/callbacks.c: In function ‘cmd_monospace_font_family’:
src/callbacks.c:152: error: ‘Behaviour’ has no member named ‘monospace_font_family’
src/callbacks.c: In function ‘cmd_sans_serif_font_family’:
src/callbacks.c:158: error: ‘Behaviour’ has no member named ‘sans_serif_font_family’
src/callbacks.c: In function ‘cmd_serif_font_family’:
src/callbacks.c:164: error: ‘Behaviour’ has no member named ‘serif_font_family’
src/callbacks.c: In function ‘cmd_cursive_font_family’:
src/callbacks.c:170: error: ‘Behaviour’ has no member named ‘cursive_font_family’
src/callbacks.c: In function ‘cmd_fantasy_font_family’:
src/callbacks.c:176: error: ‘Behaviour’ has no member named ‘fantasy_font_family’
src/callbacks.c: In function ‘cmd_zoom_level’:
src/callbacks.c:181: warning: implicit declaration of function ‘webkit_web_view_set_zoom_level’
src/callbacks.c:181: error: ‘GUI’ has no member named ‘web_view’
src/callbacks.c:181: error: ‘Behaviour’ has no member named ‘zoom_level’
src/callbacks.c: In function ‘cmd_disable_plugins’:
src/callbacks.c:187: error: ‘Behaviour’ has no member named ‘disable_plugins’
src/callbacks.c: In function ‘cmd_disable_scripts’:
src/callbacks.c:193: error: ‘Behaviour’ has no member named ‘disable_scripts’
src/callbacks.c: In function ‘cmd_minimum_font_size’:
src/callbacks.c:199: error: ‘Behaviour’ has no member named ‘minimum_font_size’
src/callbacks.c: In function ‘cmd_autoload_img’:
src/callbacks.c:204: error: ‘Behaviour’ has no member named ‘autoload_img’
src/callbacks.c: In function ‘cmd_autoshrink_img’:
src/callbacks.c:211: error: ‘Behaviour’ has no member named ‘autoshrink_img’
src/callbacks.c: In function ‘cmd_enable_spellcheck’:
src/callbacks.c:218: error: ‘Behaviour’ has no member named ‘enable_spellcheck’
src/callbacks.c: In function ‘cmd_enable_private’:
src/callbacks.c:224: error: ‘Behaviour’ has no member named ‘enable_private’
src/callbacks.c: In function ‘cmd_print_bg’:
src/callbacks.c:230: error: ‘Behaviour’ has no member named ‘print_bg’
src/callbacks.c: In function ‘cmd_style_uri’:
src/callbacks.c:236: error: ‘Behaviour’ has no member named ‘style_uri’
src/callbacks.c: In function ‘cmd_resizable_txt’:
src/callbacks.c:242: error: ‘Behaviour’ has no member named ‘resizable_txt’
src/callbacks.c: In function ‘cmd_default_encoding’:
src/callbacks.c:248: error: ‘Behaviour’ has no member named ‘default_encoding’
src/callbacks.c: In function ‘cmd_enforce_96dpi’:
src/callbacks.c:254: error: ‘Behaviour’ has no member named ‘enforce_96dpi’
src/callbacks.c: In function ‘cmd_caret_browsing’:
src/callbacks.c:260: error: ‘Behaviour’ has no member named ‘caret_browsing’
src/callbacks.c: In function ‘cmd_fifo_dir’:
src/callbacks.c:265: error: ‘Behaviour’ has no member named ‘fifo_dir’
src/callbacks.c:265: warning: implicit declaration of function ‘init_fifo’
src/callbacks.c:265: error: ‘Behaviour’ has no member named ‘fifo_dir’
src/callbacks.c: In function ‘cmd_socket_dir’:
src/callbacks.c:270: error: ‘Behaviour’ has no member named ‘socket_dir’
src/callbacks.c:270: warning: implicit declaration of function ‘init_socket’
src/callbacks.c:270: error: ‘Behaviour’ has no member named ‘socket_dir’
src/callbacks.c: In function ‘cmd_inject_html’:
src/callbacks.c:275: error: ‘Behaviour’ has no member named ‘inject_html’
src/callbacks.c:276: warning: implicit declaration of function ‘webkit_web_view_load_html_string’
src/callbacks.c:276: error: ‘GUI’ has no member named ‘web_view’
src/callbacks.c:277: error: ‘Behaviour’ has no member named ‘inject_html’
src/callbacks.c: In function ‘cmd_useragent’:
src/callbacks.c:283: error: ‘Network’ has no member named ‘useragent’
src/callbacks.c:284: warning: implicit declaration of function ‘g_free’
src/callbacks.c:284: error: ‘Network’ has no member named ‘useragent’
src/callbacks.c:285: error: ‘Network’ has no member named ‘useragent’
src/callbacks.c:287: error: ‘Network’ has no member named ‘soup_session’
src/callbacks.c:287: error: ‘SOUP_SESSION_USER_AGENT’ undeclared (first use in this function)
src/callbacks.c:288: error: ‘Network’ has no member named ‘useragent’
src/callbacks.c: In function ‘cmd_javascript_windows’:
src/callbacks.c:295: error: ‘Behaviour’ has no member named ‘javascript_windows’
src/callbacks.c: In function ‘cmd_scrollbars_visibility’:
src/callbacks.c:300: error: ‘GUI’ has no member named ‘scrollbars_visible’
src/callbacks.c:301: error: ‘GUI’ has no member named ‘bar_h’
src/callbacks.c:301: warning: implicit declaration of function ‘gtk_scrolled_window_get_hadjustment’
src/callbacks.c:301: warning: implicit declaration of function ‘GTK_SCROLLED_WINDOW’
src/callbacks.c:301: error: ‘GUI’ has no member named ‘scrolled_win’
src/callbacks.c:302: error: ‘GUI’ has no member named ‘bar_v’
src/callbacks.c:302: warning: implicit declaration of function ‘gtk_scrolled_window_get_vadjustment’
src/callbacks.c:302: error: ‘GUI’ has no member named ‘scrolled_win’
src/callbacks.c:305: error: ‘GUI’ has no member named ‘bar_v’
src/callbacks.c:305: warning: implicit declaration of function ‘gtk_range_get_adjustment’
src/callbacks.c:305: warning: implicit declaration of function ‘GTK_RANGE’
src/callbacks.c:305: error: ‘GUI’ has no member named ‘scbar_v’
src/callbacks.c:306: error: ‘GUI’ has no member named ‘bar_h’
src/callbacks.c:306: error: ‘GUI’ has no member named ‘scbar_h’
src/callbacks.c:308: warning: implicit declaration of function ‘gtk_widget_set_scroll_adjustments’
src/callbacks.c:308: warning: implicit declaration of function ‘GTK_WIDGET’
src/callbacks.c:308: error: ‘GUI’ has no member named ‘web_view’
src/callbacks.c:308: error: ‘GUI’ has no member named ‘bar_h’
src/callbacks.c:308: error: ‘GUI’ has no member named ‘bar_v’
src/callbacks.c: In function ‘cmd_view_source’:
src/callbacks.c:314: warning: implicit declaration of function ‘webkit_web_view_set_view_source_mode’
src/callbacks.c:314: error: ‘GUI’ has no member named ‘web_view’
src/callbacks.c:315: error: ‘gboolean’ undeclared (first use in this function)
src/callbacks.c:315: error: expected ‘)’ before ‘uzbl’
src/callbacks.c: In function ‘cmd_set_zoom_type’:
src/callbacks.c:320: error: ‘Behaviour’ has no member named ‘zoom_type’
src/callbacks.c:321: warning: implicit declaration of function ‘webkit_web_view_set_full_content_zoom’
src/callbacks.c:321: error: ‘GUI’ has no member named ‘web_view’
src/callbacks.c:321: error: ‘TRUE’ undeclared (first use in this function)
src/callbacks.c:323: error: ‘GUI’ has no member named ‘web_view’
src/callbacks.c:323: error: ‘FALSE’ undeclared (first use in this function)
src/callbacks.c: At top level:
src/callbacks.c:327: error: expected ‘)’ before ‘*’ token
src/callbacks.c:335: error: expected ‘)’ before ‘*’ token
src/callbacks.c:350: error: expected ‘)’ before ‘*’ token
src/callbacks.c:386: error: expected ‘)’ before ‘*’ token
src/callbacks.c:398: error: expected ‘)’ before ‘*’ token
src/callbacks.c:409: error: expected ‘)’ before ‘*’ token
src/callbacks.c:420: error: expected ‘)’ before ‘*’ token
src/callbacks.c:428: error: expected ‘)’ before ‘*’ token
src/callbacks.c:437: error: expected ‘)’ before ‘*’ token
src/callbacks.c:450: error: expected ‘)’ before ‘*’ token
src/callbacks.c:461: error: expected ‘)’ before ‘*’ token
src/callbacks.c:468: error: expected ‘=’, ‘,’, ‘;’, ‘asm’ or ‘__attribute__’ before ‘configure_event_cb’
src/callbacks.c:484: error: expected ‘=’, ‘,’, ‘;’, ‘asm’ or ‘__attribute__’ before ‘focus_cb’
src/callbacks.c:498: error: expected ‘=’, ‘,’, ‘;’, ‘asm’ or ‘__attribute__’ before ‘key_press_cb’
src/callbacks.c:508: error: expected ‘=’, ‘,’, ‘;’, ‘asm’ or ‘__attribute__’ before ‘key_release_cb’
src/callbacks.c:518: error: expected ‘=’, ‘,’, ‘;’, ‘asm’ or ‘__attribute__’ before ‘button_press_cb’
src/callbacks.c:558: error: expected ‘=’, ‘,’, ‘;’, ‘asm’ or ‘__attribute__’ before ‘button_release_cb’
src/callbacks.c:587: error: expected ‘=’, ‘,’, ‘;’, ‘asm’ or ‘__attribute__’ before ‘motion_notify_cb’
src/callbacks.c:600: error: expected ‘=’, ‘,’, ‘;’, ‘asm’ or ‘__attribute__’ before ‘navigation_decision_cb’
src/callbacks.c:638: error: expected ‘=’, ‘,’, ‘;’, ‘asm’ or ‘__attribute__’ before ‘new_window_cb’
src/callbacks.c:669: error: expected ‘=’, ‘,’, ‘;’, ‘asm’ or ‘__attribute__’ before ‘mime_policy_cb’
src/callbacks.c:686: error: expected ‘)’ before ‘*’ token
src/callbacks.c:698: error: expected ‘)’ before ‘*’ token
src/callbacks.c:715: error: expected ‘=’, ‘,’, ‘;’, ‘asm’ or ‘__attribute__’ before ‘create_web_view_js_cb’
src/callbacks.c:725: error: expected ‘=’, ‘,’, ‘;’, ‘asm’ or ‘__attribute__’ before ‘*’ token
src/callbacks.c:759: error: expected ‘=’, ‘,’, ‘;’, ‘asm’ or ‘__attribute__’ before ‘download_cb’
src/callbacks.c:768: error: expected ‘)’ before ‘*’ token
src/callbacks.c:776: error: expected ‘)’ before ‘*’ token
src/callbacks.c:834: error: expected ‘)’ before ‘*’ token
src/callbacks.c:852: error: expected ‘)’ before ‘*’ token
make: *** [callbacks.o] Erreur 1

Quelqu'un pourrait il m'aider à déchiffrer ce message ? J'ai sans doute oublié d'installer d'autres outils nécéssaires à la compilation, mais je ne sais pas quoi hmm

Merci

Hors ligne

#40 Le 16/08/2010, à 21:55

helly

Re : uzbl une autre façon de naviguer

Il te dis quels packages ne sont pas présents, et qu'il faut donc installer wink.
Mais pourquoi tu installes via les sources et pas via les dépots ?


Archlinux-wmii-dwb.
Un problème résolu ? Faites le savoir en mettant [résolu] à côté du titre de votre topic.
Un problème non résolu ? Faites le savoir en insultant ceux qui cherchent à vous aider.
Un site bleu super remasterised©, un wiki cherchant des volontaires pour traduire un site.

Hors ligne

#41 Le 16/08/2010, à 22:01

Kyramud

Re : uzbl une autre façon de naviguer

Via le dépot il n'y a que la version minimaliste du logiciel, notamment sans aucune gestion des onglets. La totalité des fonctionnalités n'est disponible qu'en utilisant directement les sources. À moins que j'ai loupé quelque chose d'autre ? hmm

J'ai un peu honte de pas avoir pensé aux dépendances là, je me concentrais sur un hypothétique problème de pkg-config ><

Merci smile

Dernière modification par Kyramud (Le 16/08/2010, à 22:01)

Hors ligne

#42 Le 16/08/2010, à 22:03

helly

Re : uzbl une autre façon de naviguer

notamment sans aucune gestion des onglets

Pas faux. Mais avec un WM comme wmii, comme on a un nombre infini de bureaux virtuels, jfais une fenêtre par page et ça me fait un système d'onglets tongue.


Archlinux-wmii-dwb.
Un problème résolu ? Faites le savoir en mettant [résolu] à côté du titre de votre topic.
Un problème non résolu ? Faites le savoir en insultant ceux qui cherchent à vous aider.
Un site bleu super remasterised©, un wiki cherchant des volontaires pour traduire un site.

Hors ligne

#43 Le 16/08/2010, à 23:08

DaveNull

Re : uzbl une autre façon de naviguer

Soit dit en passant, il existe un dépot launchpad plus à jour que celui d'ubuntu pour installer un uzbl plus à jour sans ce casser le c*l à compiler webkit-gtk et tout le bordel.

Ils en parlent ici : http://www.bordel-de-nerd.net/2009/09/uzbl-le-vi-des-navigateurs-web/


« Ce pangramme autodescriptif en hommage à Douglas Hofstadter, Lee Sallows, Jacques Pitrat, Nicolas Graner et Éric Angelini contient exactement dix-sept a, un b, onze c, huit d, trente-cinq e, cinq f, neuf g, six h, vingt-quatre i, deux j, un k, sept l, six m, vingt-six n, onze o, huit p, huit q, onze r, quinze s, vingt-sept t, dix-sept u, quatre v, deux w, neuf x, un y, et cinq z. »
— oulipo

Hors ligne

#44 Le 10/03/2011, à 00:08

SkyZ

Re : uzbl une autre façon de naviguer

Bonsoir j'avais une question a propos de uzbl. Est-il possible de mettre la barre du bas en haut, par soucis d'ergonomie personelle ?

Hors ligne

Haut de page ↑