Contenu | Rechercher | Menus

Annonce

Si vous avez des soucis pour rester connecté, déconnectez-vous puis reconnectez-vous depuis ce lien en cochant la case
Me connecter automatiquement lors de mes prochaines visites.

À propos de l'équipe du forum.

#1 Le 01/03/2007, à 23:29

Jean-lux

Impossible d'installer CVSCedega, un problème a make !

Bonsoir,

j'ai un problème lors de l'installation de CVScedega

Lors de la phase "make", j'ai cette erreur :

Compiling ...


    TIP: look, behind you!ifferences:
    Wine is a "windows compability layer" that allows
--------- Error log - file /home/jean-luc/.WineCVS/sources/cvscedega/ErrorLog : ---------a is a fork of Wine, with the main focus being
./ppl.l:1378: error: ‘pp_macexp’ undeclared (first use in this function)
./ppl.l:1379: warning: implicit declaration of function ‘push_buffer’
./ppl.l: In function ‘macro_add_expansion’:
./ppl.l:1387: error: ‘macexpstackentry_t’ undeclared (first use in this function)
./ppl.l:1387: error: ‘mep’ undeclared (first use in this function)
./ppl.l:1396: error: ‘debuglevel’ undeclared (first use in this function)
./ppl.l:1396: error: ‘DEBUGLEVEL_PPLEX’ undeclared (first use in this function)
./ppl.l:1398: error: ‘input_name’ undeclared (first use in this function)
./ppl.l:1399: error: ‘line_number’ undeclared (first use in this function)
./ppl.l: At top level:
./ppl.l:1411: warning: conflicting types for ‘put_buffer’
./ppl.l:1411: error: static declaration of ‘put_buffer’ follows non-static declaration
./ppl.l:476: error: previous implicit declaration of ‘put_buffer’ was here
./ppl.l: In function ‘put_buffer’:
./ppl.l:1415: error: ‘pass_data’ undeclared (first use in this function)
./ppl.l: In function ‘do_include’:
./ppl.l:1439: error: ‘includelogicentry_t’ undeclared (first use in this function)
./ppl.l:1439: error: ‘iep’ undeclared (first use in this function)
./ppl.l:1441: error: ‘includelogiclist’ undeclared (first use in this function)
./ppl.l:1462: warning: implicit declaration of function ‘open_include’
./ppl.l:1462: warning: assignment makes pointer from integer without a cast
./ppl.l:1467: error: ‘seen_junk’ undeclared (first use in this function)
./ppl.l:1468: error: ‘include_state’ undeclared (first use in this function)
./ppl.l:1469: error: ‘include_ppp’ undeclared (first use in this function)
./ppl.l:1470: error: ‘pass_data’ undeclared (first use in this function)
./ppl.l:1473: error: ‘debuglevel’ undeclared (first use in this function)
./ppl.l:1473: error: ‘DEBUGLEVEL_PPMSG’ undeclared (first use in this function)
./ppl.l:1474: error: ‘input_name’ undeclared (first use in this function)
./ppl.l:1474: error: ‘line_number’ undeclared (first use in this function)
./ppl.l:1474: error: ‘include_ifdepth’ undeclared (first use in this function)
./ppl.l: In function ‘push_ignore_state’:
./ppl.l:1488: error: ‘pp_ignore’ undeclared (first use in this function)
make[2]: *** [lex.ppl.o] Erreur 1
make[2]: *** Attente des tâches non terminées....
gcc -MMD -c  -I. -I. -I../../include -I../../include  -g -O2 -Wall -mpreferred-stack-boundary=2 -fno-keep-static-consts -D__const=const -fno-strict-aliasing -Wa,--execstack -D__int8=char -D__int16=short -D__int32=int "-D__int64=long long"  -D_REENTRANT  -o widl.o widl.c
make[2]: quittant le répertoire « /home/jean-luc/.WineCVS/sources/cvscedega/winex/tools/wrc »
make[1]: *** [wrc] Erreur 2
make[1]: *** Attente des tâches non terminées....
gcc -MMD -c  -I. -I. -I../../include -I../../include  -g -O2 -Wall -mpreferred-stack-boundary=2 -fno-keep-static-consts -D__const=const -fno-strict-aliasing -Wa,--execstack -D__int8=char -D__int16=short -D__int32=int "-D__int64=long long"  -D_REENTRANT  -o write_msft.o write_msft.c
bison -y  -p parser_ -o parser.tab.c -d parser.y
conflits: 12 décalage/réduction
flex  -t parser.l >parser.yy.c || (rm -f parser.yy.c && exit 1)
bison -y  -p parser_ -o parser.tab.c parser.y
gcc -MMD -c  -I. -I. -I../../include -I../../include  -g -O2 -Wall -mpreferred-stack-boundary=2 -fno-keep-static-consts -D__const=const -fno-strict-aliasing -Wa,--execstack -D__int8=char -D__int16=short -D__int32=int "-D__int64=long long"  -D_REENTRANT  -o parser.yy.o parser.yy.c
conflits: 12 décalage/réduction
gcc -MMD -c  -I. -I. -I../../include -I../../include  -g -O2 -Wall -mpreferred-stack-boundary=2 -fno-keep-static-consts -D__const=const -fno-strict-aliasing -Wa,--execstack -D__int8=char -D__int16=short -D__int32=int "-D__int64=long long"  -D_REENTRANT  -o parser.tab.o parser.tab.c
gcc -g -O2 -Wall -mpreferred-stack-boundary=2 -fno-keep-static-consts -D__const=const -fno-strict-aliasing -Wa,--execstack -D__int8=char -D__int16=short -D__int32=int "-D__int64=long long" -o widl  client.o hash.o header.o proxy.o server.o typegen.o typelib.o utils.o widl.o write_msft.o     parser.tab.o parser.yy.o  ../../libs/wpp/libwpp.a -L../../port -lwine_port -lfl
make[2]: quittant le répertoire « /home/jean-luc/.WineCVS/sources/cvscedega/winex/tools/widl »
make[1]: quittant le répertoire « /home/jean-luc/.WineCVS/sources/cvscedega/winex/tools »
make: *** [tools] Erreur 2


Error in Make

Try fixing the error based on the output above, and
run the script again, without paramaters (Eg: WineCVS.sh)

Que faire ?

Merci


Un jour... Le manchot cassera la fenêtre !

Remboursez votre forfait non utilisé sur http://goo.gl/uQyCq NOFAKE.

Hors ligne