Contenu | Rechercher | Menus

Annonce

Si vous rencontrez des soucis à rester connecté sur le forum (ou si vous avez perdu votre mot de passe) déconnectez-vous et reconnectez-vous depuis cette page, en cochant la case "Me connecter automatiquement lors de mes prochaines visites".
Test de l'ISO d'Ubuntu francophone : nous avons besoin de testeurs pour la version francophone d'Ubuntu 14.04. Liens et informations ici.

Attention, une faille de sécurité dans bash a récemment été rapportée, il est recommandé de mettre à jour son système (plus de détails)

#1 Le 19/06/2012, à 14:49

steve29

[ RESOLU] Erreur d'install drivers RALINK 3090pci apres MAJ Kernel

Salut,

Je viens de mettre à jour Xubuntu 12.04 avec la MAJ du kernel ( 3.2.0-25 --> 3.2.0-26 )
Lors de changement de kernel je dois réinstaller le drivers pour ma carte interne PCI-e Ralink RT3090
avec un sudo make ; sudo make install .

Donc je ne m'étonne pas et je procède à la manip ..sauf que cette fois  ERREUR 1 & 2 avec arrêt du "make" !
Pour vérifier que la carte n'a pas de problème je reboot et avec Grub j'opte pour le Kernel précédent .
Et là pas de pb la carte est détectée et le module chargé...bref ça baigne .

Je vous poste le bla-bla :^) ...les 2 erreurs fatales sont aux 4 dernière lignes

XXX@XXX-HP-ProBook-4525s:~/drivers/20101216_RT3090_LinuxSTA_V2.4.0.4_WiFiBTCombo_DPO$ sudo make
[sudo] password for XXX: 
make -C tools
make[1]: entrant dans le répertoire « /home/XXX/drivers/20101216_RT3090_LinuxSTA_V2.4.0.4_WiFiBTCombo_DPO/tools »
gcc -g bin2h.c -o bin2h
make[1]: quittant le répertoire « /home/XXX/drivers/20101216_RT3090_LinuxSTA_V2.4.0.4_WiFiBTCombo_DPO/tools »
/home/XXX/drivers/20101216_RT3090_LinuxSTA_V2.4.0.4_WiFiBTCombo_DPO/tools/bin2h
cp -f os/linux/Makefile.6 /home/XXX/drivers/20101216_RT3090_LinuxSTA_V2.4.0.4_WiFiBTCombo_DPO/os/linux/Makefile
make -C /lib/modules/3.2.0-26-generic/build SUBDIRS=/home/XXX/drivers/20101216_RT3090_LinuxSTA_V2.4.0.4_WiFiBTCombo_DPO/os/linux modules
make[1]: entrant dans le répertoire « /usr/src/linux-headers-3.2.0-26-generic »
  CC [M]  /home/XXX/drivers/20101216_RT3090_LinuxSTA_V2.4.0.4_WiFiBTCombo_DPO/os/linux/../../common/crypt_md5.o
  CC [M]  /home/XXX/drivers/20101216_RT3090_LinuxSTA_V2.4.0.4_WiFiBTCombo_DPO/os/linux/../../common/crypt_sha2.o
  CC [M]  /home/XXX/drivers/20101216_RT3090_LinuxSTA_V2.4.0.4_WiFiBTCombo_DPO/os/linux/../../common/crypt_hmac.o
  CC [M]  /home/XXX/drivers/20101216_RT3090_LinuxSTA_V2.4.0.4_WiFiBTCombo_DPO/os/linux/../../common/crypt_aes.o
/home/XXX/drivers/20101216_RT3090_LinuxSTA_V2.4.0.4_WiFiBTCombo_DPO/os/linux/../../common/crypt_aes.c: In function ‘WscEncryptData’:
/home/XXX/drivers/20101216_RT3090_LinuxSTA_V2.4.0.4_WiFiBTCombo_DPO/os/linux/../../common/crypt_aes.c:1522:1: attention : the frame size of 1408 bytes is larger than 1024 bytes [-Wframe-larger-than=]
/home/XXX/drivers/20101216_RT3090_LinuxSTA_V2.4.0.4_WiFiBTCombo_DPO/os/linux/../../common/crypt_aes.c: In function ‘WscDecryptData’:
/home/XXX/drivers/20101216_RT3090_LinuxSTA_V2.4.0.4_WiFiBTCombo_DPO/os/linux/../../common/crypt_aes.c:1592:1: attention : the frame size of 1408 bytes is larger than 1024 bytes [-Wframe-larger-than=]
/home/XXX/drivers/20101216_RT3090_LinuxSTA_V2.4.0.4_WiFiBTCombo_DPO/os/linux/../../common/crypt_aes.c: In function ‘AES_GTK_KEY_WRAP’:
/home/XXX/drivers/20101216_RT3090_LinuxSTA_V2.4.0.4_WiFiBTCombo_DPO/os/linux/../../common/crypt_aes.c:2265:1: attention : the frame size of 1616 bytes is larger than 1024 bytes [-Wframe-larger-than=]
/home/XXX/drivers/20101216_RT3090_LinuxSTA_V2.4.0.4_WiFiBTCombo_DPO/os/linux/../../common/crypt_aes.c: In function ‘AES_GTK_KEY_UNWRAP’:
/home/XXX/drivers/20101216_RT3090_LinuxSTA_V2.4.0.4_WiFiBTCombo_DPO/os/linux/../../common/crypt_aes.c:2348:1: attention : the frame size of 1152 bytes is larger than 1024 bytes [-Wframe-larger-than=]
  CC [M]  /home/XXX/drivers/20101216_RT3090_LinuxSTA_V2.4.0.4_WiFiBTCombo_DPO/os/linux/../../common/crypt_arc4.o
  CC [M]  /home/XXX/drivers/20101216_RT3090_LinuxSTA_V2.4.0.4_WiFiBTCombo_DPO/os/linux/../../common/mlme.o
/home/XXX/drivers/20101216_RT3090_LinuxSTA_V2.4.0.4_WiFiBTCombo_DPO/os/linux/../../common/mlme.c: In function ‘MlmeResetRalinkCounters’:
/home/XXX/drivers/20101216_RT3090_LinuxSTA_V2.4.0.4_WiFiBTCombo_DPO/os/linux/../../common/mlme.c:870:2: attention : transtypage d'un pointeur vers un entier de taille différente [-Wpointer-to-int-cast]
/home/XXX/drivers/20101216_RT3090_LinuxSTA_V2.4.0.4_WiFiBTCombo_DPO/os/linux/../../common/mlme.c:870:2: attention : transtypage d'un pointeur vers un entier de taille différente [-Wpointer-to-int-cast]
/home/XXX/drivers/20101216_RT3090_LinuxSTA_V2.4.0.4_WiFiBTCombo_DPO/os/linux/../../common/mlme.c: In function ‘BssTableSetEntry’:
/home/XXX/drivers/20101216_RT3090_LinuxSTA_V2.4.0.4_WiFiBTCombo_DPO/os/linux/../../common/mlme.c:5822:39: attention : operation on ‘Tab->BssOverlapNr’ may be undefined [-Wsequence-point]
/home/XXX/drivers/20101216_RT3090_LinuxSTA_V2.4.0.4_WiFiBTCombo_DPO/os/linux/../../common/mlme.c: In function ‘BssTableSortByRssi’:
/home/XXX/drivers/20101216_RT3090_LinuxSTA_V2.4.0.4_WiFiBTCombo_DPO/os/linux/../../common/mlme.c:6183:1: attention : the frame size of 1744 bytes is larger than 1024 bytes [-Wframe-larger-than=]
  CC [M]  /home/XXX/drivers/20101216_RT3090_LinuxSTA_V2.4.0.4_WiFiBTCombo_DPO/os/linux/../../common/cmm_wep.o
  CC [M]  /home/XXX/drivers/20101216_RT3090_LinuxSTA_V2.4.0.4_WiFiBTCombo_DPO/os/linux/../../common/action.o
  CC [M]  /home/XXX/drivers/20101216_RT3090_LinuxSTA_V2.4.0.4_WiFiBTCombo_DPO/os/linux/../../common/cmm_data.o
  CC [M]  /home/XXX/drivers/20101216_RT3090_LinuxSTA_V2.4.0.4_WiFiBTCombo_DPO/os/linux/../../common/rtmp_init.o
  CC [M]  /home/XXX/drivers/20101216_RT3090_LinuxSTA_V2.4.0.4_WiFiBTCombo_DPO/os/linux/../../common/cmm_tkip.o
  CC [M]  /home/XXX/drivers/20101216_RT3090_LinuxSTA_V2.4.0.4_WiFiBTCombo_DPO/os/linux/../../common/cmm_aes.o
  CC [M]  /home/XXX/drivers/20101216_RT3090_LinuxSTA_V2.4.0.4_WiFiBTCombo_DPO/os/linux/../../common/cmm_sync.o
  CC [M]  /home/XXX/drivers/20101216_RT3090_LinuxSTA_V2.4.0.4_WiFiBTCombo_DPO/os/linux/../../common/eeprom.o
  CC [M]  /home/XXX/drivers/20101216_RT3090_LinuxSTA_V2.4.0.4_WiFiBTCombo_DPO/os/linux/../../common/cmm_sanity.o
  CC [M]  /home/XXX/drivers/20101216_RT3090_LinuxSTA_V2.4.0.4_WiFiBTCombo_DPO/os/linux/../../common/cmm_info.o
  CC [M]  /home/XXX/drivers/20101216_RT3090_LinuxSTA_V2.4.0.4_WiFiBTCombo_DPO/os/linux/../../common/cmm_cfg.o
  CC [M]  /home/XXX/drivers/20101216_RT3090_LinuxSTA_V2.4.0.4_WiFiBTCombo_DPO/os/linux/../../common/cmm_wpa.o
  CC [M]  /home/XXX/drivers/20101216_RT3090_LinuxSTA_V2.4.0.4_WiFiBTCombo_DPO/os/linux/../../common/dfs.o
  CC [M]  /home/XXX/drivers/20101216_RT3090_LinuxSTA_V2.4.0.4_WiFiBTCombo_DPO/os/linux/../../common/spectrum.o
/home/XXX/drivers/20101216_RT3090_LinuxSTA_V2.4.0.4_WiFiBTCombo_DPO/os/linux/../../common/spectrum.c: In function ‘PeerMeasureReportAction’:
/home/XXX/drivers/20101216_RT3090_LinuxSTA_V2.4.0.4_WiFiBTCombo_DPO/os/linux/../../common/spectrum.c:1966:3: attention : format ‘%d’ expects argument of type ‘int’, but argument 3 has type ‘long unsigned int’ [-Wformat]
  CC [M]  /home/XXX/drivers/20101216_RT3090_LinuxSTA_V2.4.0.4_WiFiBTCombo_DPO/os/linux/../../common/rtmp_timer.o
  CC [M]  /home/XXX/drivers/20101216_RT3090_LinuxSTA_V2.4.0.4_WiFiBTCombo_DPO/os/linux/../../common/rt_channel.o
  CC [M]  /home/XXX/drivers/20101216_RT3090_LinuxSTA_V2.4.0.4_WiFiBTCombo_DPO/os/linux/../../common/cmm_profile.o
  CC [M]  /home/XXX/drivers/20101216_RT3090_LinuxSTA_V2.4.0.4_WiFiBTCombo_DPO/os/linux/../../common/cmm_asic.o
  CC [M]  /home/XXX/drivers/20101216_RT3090_LinuxSTA_V2.4.0.4_WiFiBTCombo_DPO/os/linux/../../common/cmm_cmd.o
  CC [M]  /home/XXX/drivers/20101216_RT3090_LinuxSTA_V2.4.0.4_WiFiBTCombo_DPO/os/linux/../../sta/assoc.o
  CC [M]  /home/XXX/drivers/20101216_RT3090_LinuxSTA_V2.4.0.4_WiFiBTCombo_DPO/os/linux/../../sta/auth.o
  CC [M]  /home/XXX/drivers/20101216_RT3090_LinuxSTA_V2.4.0.4_WiFiBTCombo_DPO/os/linux/../../sta/auth_rsp.o
  CC [M]  /home/XXX/drivers/20101216_RT3090_LinuxSTA_V2.4.0.4_WiFiBTCombo_DPO/os/linux/../../sta/sync.o
/home/XXX/drivers/20101216_RT3090_LinuxSTA_V2.4.0.4_WiFiBTCombo_DPO/os/linux/../../sta/sync.c: In function ‘PeerBeaconAtJoinAction’:
/home/XXX/drivers/20101216_RT3090_LinuxSTA_V2.4.0.4_WiFiBTCombo_DPO/os/linux/../../sta/sync.c:1085:1: attention : the frame size of 1344 bytes is larger than 1024 bytes [-Wframe-larger-than=]
/home/XXX/drivers/20101216_RT3090_LinuxSTA_V2.4.0.4_WiFiBTCombo_DPO/os/linux/../../sta/sync.c: In function ‘PeerBeaconAtScanAction’:
/home/XXX/drivers/20101216_RT3090_LinuxSTA_V2.4.0.4_WiFiBTCombo_DPO/os/linux/../../sta/sync.c:755:1: attention : the frame size of 1296 bytes is larger than 1024 bytes [-Wframe-larger-than=]
/home/XXX/drivers/20101216_RT3090_LinuxSTA_V2.4.0.4_WiFiBTCombo_DPO/os/linux/../../sta/sync.c: In function ‘PeerBeacon’:
/home/XXX/drivers/20101216_RT3090_LinuxSTA_V2.4.0.4_WiFiBTCombo_DPO/os/linux/../../sta/sync.c:1756:1: attention : the frame size of 1392 bytes is larger than 1024 bytes [-Wframe-larger-than=]
  CC [M]  /home/XXX/drivers/20101216_RT3090_LinuxSTA_V2.4.0.4_WiFiBTCombo_DPO/os/linux/../../sta/sanity.o
  CC [M]  /home/XXX/drivers/20101216_RT3090_LinuxSTA_V2.4.0.4_WiFiBTCombo_DPO/os/linux/../../sta/rtmp_data.o
  CC [M]  /home/XXX/drivers/20101216_RT3090_LinuxSTA_V2.4.0.4_WiFiBTCombo_DPO/os/linux/../../sta/connect.o
/home/XXX/drivers/20101216_RT3090_LinuxSTA_V2.4.0.4_WiFiBTCombo_DPO/os/linux/../../sta/connect.c: In function ‘CntlOidScanProc’:
/home/XXX/drivers/20101216_RT3090_LinuxSTA_V2.4.0.4_WiFiBTCombo_DPO/os/linux/../../sta/connect.c:314:1: attention : the frame size of 1776 bytes is larger than 1024 bytes [-Wframe-larger-than=]
  CC [M]  /home/XXX/drivers/20101216_RT3090_LinuxSTA_V2.4.0.4_WiFiBTCombo_DPO/os/linux/../../sta/wpa.o
  CC [M]  /home/XXX/drivers/20101216_RT3090_LinuxSTA_V2.4.0.4_WiFiBTCombo_DPO/os/linux/../../sta/ags.o
  CC [M]  /home/XXX/drivers/20101216_RT3090_LinuxSTA_V2.4.0.4_WiFiBTCombo_DPO/os/linux/../../sta/sta_cfg.o
  CC [M]  /home/XXX/drivers/20101216_RT3090_LinuxSTA_V2.4.0.4_WiFiBTCombo_DPO/os/linux/../../common/rtmp_init_inf.o
  CC [M]  /home/XXX/drivers/20101216_RT3090_LinuxSTA_V2.4.0.4_WiFiBTCombo_DPO/os/linux/../../os/linux/rt_profile.o
  CC [M]  /home/XXX/drivers/20101216_RT3090_LinuxSTA_V2.4.0.4_WiFiBTCombo_DPO/os/linux/../../os/linux/sta_ioctl.o
/home/XXX/drivers/20101216_RT3090_LinuxSTA_V2.4.0.4_WiFiBTCombo_DPO/os/linux/../../os/linux/sta_ioctl.c: In function ‘rt_ioctl_iwaplist’:
/home/XXX/drivers/20101216_RT3090_LinuxSTA_V2.4.0.4_WiFiBTCombo_DPO/os/linux/../../os/linux/sta_ioctl.c:592:1: attention : the frame size of 1280 bytes is larger than 1024 bytes [-Wframe-larger-than=]
/home/XXX/drivers/20101216_RT3090_LinuxSTA_V2.4.0.4_WiFiBTCombo_DPO/os/linux/../../os/linux/sta_ioctl.c: In function ‘rt_ioctl_siwmlme’:
/home/XXX/drivers/20101216_RT3090_LinuxSTA_V2.4.0.4_WiFiBTCombo_DPO/os/linux/../../os/linux/sta_ioctl.c:1962:1: attention : the frame size of 1696 bytes is larger than 1024 bytes [-Wframe-larger-than=]
/home/XXX/drivers/20101216_RT3090_LinuxSTA_V2.4.0.4_WiFiBTCombo_DPO/os/linux/../../os/linux/sta_ioctl.c: In function ‘RTMPIoctlMAC’:
/home/XXX/drivers/20101216_RT3090_LinuxSTA_V2.4.0.4_WiFiBTCombo_DPO/os/linux/../../os/linux/sta_ioctl.c:5826:1: attention : the frame size of 1360 bytes is larger than 1024 bytes [-Wframe-larger-than=]
/home/XXX/drivers/20101216_RT3090_LinuxSTA_V2.4.0.4_WiFiBTCombo_DPO/os/linux/../../os/linux/sta_ioctl.c: In function ‘RTMPIoctlE2PROM’:
/home/XXX/drivers/20101216_RT3090_LinuxSTA_V2.4.0.4_WiFiBTCombo_DPO/os/linux/../../os/linux/sta_ioctl.c:6025:1: attention : the frame size of 1344 bytes is larger than 1024 bytes [-Wframe-larger-than=]
  CC [M]  /home/XXX/drivers/20101216_RT3090_LinuxSTA_V2.4.0.4_WiFiBTCombo_DPO/os/linux/../../os/linux/rt_linux.o
/home/XXX/drivers/20101216_RT3090_LinuxSTA_V2.4.0.4_WiFiBTCombo_DPO/os/linux/../../os/linux/rt_linux.c: In function ‘duplicate_pkt’:
/home/XXX/drivers/20101216_RT3090_LinuxSTA_V2.4.0.4_WiFiBTCombo_DPO/os/linux/../../os/linux/rt_linux.c:484:3: attention : passing argument 1 of ‘memmove’ makes pointer from integer without a cast [enabled by default]
/usr/src/linux-headers-3.2.0-26-generic/arch/x86/include/asm/string_64.h:58:7: note: expected ‘void *’ but argument is of type ‘sk_buff_data_t’
/home/XXX/drivers/20101216_RT3090_LinuxSTA_V2.4.0.4_WiFiBTCombo_DPO/os/linux/../../os/linux/rt_linux.c:486:3: attention : passing argument 1 of ‘memmove’ makes pointer from integer without a cast [enabled by default]
/usr/src/linux-headers-3.2.0-26-generic/arch/x86/include/asm/string_64.h:58:7: note: expected ‘void *’ but argument is of type ‘sk_buff_data_t’
/home/XXX/drivers/20101216_RT3090_LinuxSTA_V2.4.0.4_WiFiBTCombo_DPO/os/linux/../../os/linux/rt_linux.c: In function ‘ClonePacket’:
/home/XXX/drivers/20101216_RT3090_LinuxSTA_V2.4.0.4_WiFiBTCombo_DPO/os/linux/../../os/linux/rt_linux.c:636:23: attention : assignment makes integer from pointer without a cast [enabled by default]
/home/XXX/drivers/20101216_RT3090_LinuxSTA_V2.4.0.4_WiFiBTCombo_DPO/os/linux/../../os/linux/rt_linux.c: In function ‘update_os_packet_info’:
/home/XXX/drivers/20101216_RT3090_LinuxSTA_V2.4.0.4_WiFiBTCombo_DPO/os/linux/../../os/linux/rt_linux.c:658:15: attention : assignment makes integer from pointer without a cast [enabled by default]
/home/XXX/drivers/20101216_RT3090_LinuxSTA_V2.4.0.4_WiFiBTCombo_DPO/os/linux/../../os/linux/rt_linux.c: In function ‘wlan_802_11_to_802_3_packet’:
/home/XXX/drivers/20101216_RT3090_LinuxSTA_V2.4.0.4_WiFiBTCombo_DPO/os/linux/../../os/linux/rt_linux.c:679:15: attention : assignment makes integer from pointer without a cast [enabled by default]
/home/XXX/drivers/20101216_RT3090_LinuxSTA_V2.4.0.4_WiFiBTCombo_DPO/os/linux/../../os/linux/rt_linux.c: In function ‘send_monitor_packets’:
/home/XXX/drivers/20101216_RT3090_LinuxSTA_V2.4.0.4_WiFiBTCombo_DPO/os/linux/../../os/linux/rt_linux.c:952:9: attention : format ‘%d’ expects argument of type ‘int’, but argument 3 has type ‘long unsigned int’ [-Wformat]
/home/XXX/drivers/20101216_RT3090_LinuxSTA_V2.4.0.4_WiFiBTCombo_DPO/os/linux/../../os/linux/rt_linux.c: In function ‘RtmpOSNetDevDetach’:
/home/XXX/drivers/20101216_RT3090_LinuxSTA_V2.4.0.4_WiFiBTCombo_DPO/os/linux/../../os/linux/rt_linux.c:1701:38: attention : initialization discards ‘const’ qualifier from pointer target type [enabled by default]
/home/XXX/drivers/20101216_RT3090_LinuxSTA_V2.4.0.4_WiFiBTCombo_DPO/os/linux/../../os/linux/rt_linux.c: In function ‘RtmpOSNetDevAttach’:
/home/XXX/drivers/20101216_RT3090_LinuxSTA_V2.4.0.4_WiFiBTCombo_DPO/os/linux/../../os/linux/rt_linux.c:1738:38: attention : initialization discards ‘const’ qualifier from pointer target type [enabled by default]
  CC [M]  /home/XXX/drivers/20101216_RT3090_LinuxSTA_V2.4.0.4_WiFiBTCombo_DPO/os/linux/../../os/linux/rt_main_dev.o
/home/XXX/drivers/20101216_RT3090_LinuxSTA_V2.4.0.4_WiFiBTCombo_DPO/os/linux/../../os/linux/rt_main_dev.c: In function ‘MainVirtualIF_close’:
/home/XXX/drivers/20101216_RT3090_LinuxSTA_V2.4.0.4_WiFiBTCombo_DPO/os/linux/../../os/linux/rt_main_dev.c:121:13: attention : unused variable ‘Cancelled’ [-Wunused-variable]
  CC [M]  /home/XXX/drivers/20101216_RT3090_LinuxSTA_V2.4.0.4_WiFiBTCombo_DPO/os/linux/../../common/ba_action.o
/home/XXX/drivers/20101216_RT3090_LinuxSTA_V2.4.0.4_WiFiBTCombo_DPO/os/linux/../../common/ba_action.c: In function ‘convert_reordering_packet_to_preAMSDU_or_802_3_packet’:
/home/XXX/drivers/20101216_RT3090_LinuxSTA_V2.4.0.4_WiFiBTCombo_DPO/os/linux/../../common/ba_action.c:1568:2: attention : assignment makes integer from pointer without a cast [enabled by default]
  CC [M]  /home/XXX/drivers/20101216_RT3090_LinuxSTA_V2.4.0.4_WiFiBTCombo_DPO/os/linux/../../common/cmm_mac_pci.o
  CC [M]  /home/XXX/drivers/20101216_RT3090_LinuxSTA_V2.4.0.4_WiFiBTCombo_DPO/os/linux/../../common/cmm_data_pci.o
  CC [M]  /home/XXX/drivers/20101216_RT3090_LinuxSTA_V2.4.0.4_WiFiBTCombo_DPO/os/linux/../../common/ee_prom.o
  CC [M]  /home/XXX/drivers/20101216_RT3090_LinuxSTA_V2.4.0.4_WiFiBTCombo_DPO/os/linux/../../common/ee_efuse.o
  CC [M]  /home/XXX/drivers/20101216_RT3090_LinuxSTA_V2.4.0.4_WiFiBTCombo_DPO/os/linux/../../common/rtmp_mcu.o
/home/XXX/drivers/20101216_RT3090_LinuxSTA_V2.4.0.4_WiFiBTCombo_DPO/os/linux/../../common/rtmp_mcu.c: In function ‘RtmpAsicLoadFirmware’:
/home/XXX/drivers/20101216_RT3090_LinuxSTA_V2.4.0.4_WiFiBTCombo_DPO/os/linux/../../common/rtmp_mcu.c:352:2: attention : ISO C89 interdit les mélanges de déclarations et de code [-Wdeclaration-after-statement]
/home/XXX/drivers/20101216_RT3090_LinuxSTA_V2.4.0.4_WiFiBTCombo_DPO/os/linux/../../common/rtmp_mcu.c:355:2: attention : passing argument 1 of ‘writel’ makes integer from pointer without a cast [enabled by default]
/usr/src/linux-headers-3.2.0-26-generic/arch/x86/include/asm/io.h:63:1: note: expected ‘unsigned int’ but argument is of type ‘ULONG *’
/home/XXX/drivers/20101216_RT3090_LinuxSTA_V2.4.0.4_WiFiBTCombo_DPO/os/linux/../../common/rtmp_mcu.c:356:2: attention : format ‘%d’ expects argument of type ‘int’, but argument 2 has type ‘ULONG’ [-Wformat]
  CC [M]  /home/XXX/drivers/20101216_RT3090_LinuxSTA_V2.4.0.4_WiFiBTCombo_DPO/os/linux/../../chips/rt30xx.o
  CC [M]  /home/XXX/drivers/20101216_RT3090_LinuxSTA_V2.4.0.4_WiFiBTCombo_DPO/os/linux/../../common/rt_rf.o
  CC [M]  /home/XXX/drivers/20101216_RT3090_LinuxSTA_V2.4.0.4_WiFiBTCombo_DPO/os/linux/../../chips/rt3090.o
  CC [M]  /home/XXX/drivers/20101216_RT3090_LinuxSTA_V2.4.0.4_WiFiBTCombo_DPO/os/linux/../../os/linux/rt_pci_rbus.o
  CC [M]  /home/XXX/drivers/20101216_RT3090_LinuxSTA_V2.4.0.4_WiFiBTCombo_DPO/os/linux/../../os/linux/rt_rbus_pci_util.o
  CC [M]  /home/XXX/drivers/20101216_RT3090_LinuxSTA_V2.4.0.4_WiFiBTCombo_DPO/os/linux/../../os/linux/pci_main_dev.o
/home/XXX/drivers/20101216_RT3090_LinuxSTA_V2.4.0.4_WiFiBTCombo_DPO/os/linux/../../os/linux/pci_main_dev.c: In function ‘rt2860_probe’:
/home/XXX/drivers/20101216_RT3090_LinuxSTA_V2.4.0.4_WiFiBTCombo_DPO/os/linux/../../os/linux/pci_main_dev.c:309:13: attention : assignment discards ‘const’ qualifier from pointer target type [enabled by default]
/home/XXX/drivers/20101216_RT3090_LinuxSTA_V2.4.0.4_WiFiBTCombo_DPO/os/linux/../../os/linux/pci_main_dev.c: In function ‘RTMPrt3xSetPCIePowerLinkCtrl’:
/home/XXX/drivers/20101216_RT3090_LinuxSTA_V2.4.0.4_WiFiBTCombo_DPO/os/linux/../../os/linux/pci_main_dev.c:941:2: attention : format ‘%x’ expects argument of type ‘unsigned int’, but argument 2 has type ‘ULONG’ [-Wformat]
/home/XXX/drivers/20101216_RT3090_LinuxSTA_V2.4.0.4_WiFiBTCombo_DPO/os/linux/../../os/linux/pci_main_dev.c:974:5: attention : format ‘%x’ expects argument of type ‘unsigned int’, but argument 2 has type ‘ULONG’ [-Wformat]
/home/XXX/drivers/20101216_RT3090_LinuxSTA_V2.4.0.4_WiFiBTCombo_DPO/os/linux/../../os/linux/pci_main_dev.c:986:5: attention : format ‘%x’ expects argument of type ‘unsigned int’, but argument 2 has type ‘ULONG’ [-Wformat]
/home/XXX/drivers/20101216_RT3090_LinuxSTA_V2.4.0.4_WiFiBTCombo_DPO/os/linux/../../os/linux/pci_main_dev.c:949:11: attention : unused variable ‘vendor_id’ [-Wunused-variable]
/home/XXX/drivers/20101216_RT3090_LinuxSTA_V2.4.0.4_WiFiBTCombo_DPO/os/linux/../../os/linux/pci_main_dev.c:1000:2: attention : format ‘%x’ expects argument of type ‘unsigned int’, but argument 3 has type ‘ULONG’ [-Wformat]
/home/XXX/drivers/20101216_RT3090_LinuxSTA_V2.4.0.4_WiFiBTCombo_DPO/os/linux/../../os/linux/pci_main_dev.c:1027:3: attention : format ‘%x’ expects argument of type ‘unsigned int’, but argument 2 has type ‘ULONG’ [-Wformat]
/home/XXX/drivers/20101216_RT3090_LinuxSTA_V2.4.0.4_WiFiBTCombo_DPO/os/linux/../../os/linux/pci_main_dev.c:934:8: attention : unused variable ‘offset’ [-Wunused-variable]
/home/XXX/drivers/20101216_RT3090_LinuxSTA_V2.4.0.4_WiFiBTCombo_DPO/os/linux/../../os/linux/pci_main_dev.c:933:8: attention : unused variable ‘Vendor’ [-Wunused-variable]
/home/XXX/drivers/20101216_RT3090_LinuxSTA_V2.4.0.4_WiFiBTCombo_DPO/os/linux/../../os/linux/pci_main_dev.c:1006:4: attention : ‘HostConfiguration’ may be used uninitialized in this function [-Wuninitialized]
  CC [M]  /home/XXX/drivers/20101216_RT3090_LinuxSTA_V2.4.0.4_WiFiBTCombo_DPO/os/linux/../../os/linux/cfg80211.o
/home/XXX/drivers/20101216_RT3090_LinuxSTA_V2.4.0.4_WiFiBTCombo_DPO/os/linux/../../os/linux/cfg80211.c:679:2: attention : ‘enum tx_power_setting’ declared inside parameter list [enabled by default]
/home/XXX/drivers/20101216_RT3090_LinuxSTA_V2.4.0.4_WiFiBTCombo_DPO/os/linux/../../os/linux/cfg80211.c:679:2: attention : visible uniquement depuis cette définition ou déclaration, ce qui n'est probablement pas ce que vous désirez [enabled by default]
/home/XXX/drivers/20101216_RT3090_LinuxSTA_V2.4.0.4_WiFiBTCombo_DPO/os/linux/../../os/linux/cfg80211.c:678:29: erreur: parameter 2 (‘Type’) has incomplete type
/home/XXX/drivers/20101216_RT3090_LinuxSTA_V2.4.0.4_WiFiBTCombo_DPO/os/linux/../../os/linux/cfg80211.c:676:12: attention : function declaration isn’t a prototype [-Wstrict-prototypes]
/home/XXX/drivers/20101216_RT3090_LinuxSTA_V2.4.0.4_WiFiBTCombo_DPO/os/linux/../../os/linux/cfg80211.c:1355:2: attention : initialization from incompatible pointer type [enabled by default]
/home/XXX/drivers/20101216_RT3090_LinuxSTA_V2.4.0.4_WiFiBTCombo_DPO/os/linux/../../os/linux/cfg80211.c:1355:2: attention : (near initialization for ‘CFG80211_Ops.set_channel’) [enabled by default]
/home/XXX/drivers/20101216_RT3090_LinuxSTA_V2.4.0.4_WiFiBTCombo_DPO/os/linux/../../os/linux/cfg80211.c:1378:2: attention : initialization from incompatible pointer type [enabled by default]
/home/XXX/drivers/20101216_RT3090_LinuxSTA_V2.4.0.4_WiFiBTCombo_DPO/os/linux/../../os/linux/cfg80211.c:1378:2: attention : (near initialization for ‘CFG80211_Ops.add_key’) [enabled by default]
/home/XXX/drivers/20101216_RT3090_LinuxSTA_V2.4.0.4_WiFiBTCombo_DPO/os/linux/../../os/linux/cfg80211.c:1379:2: attention : initialization from incompatible pointer type [enabled by default]
/home/XXX/drivers/20101216_RT3090_LinuxSTA_V2.4.0.4_WiFiBTCombo_DPO/os/linux/../../os/linux/cfg80211.c:1379:2: attention : (near initialization for ‘CFG80211_Ops.get_key’) [enabled by default]
/home/XXX/drivers/20101216_RT3090_LinuxSTA_V2.4.0.4_WiFiBTCombo_DPO/os/linux/../../os/linux/cfg80211.c:1380:2: attention : initialization from incompatible pointer type [enabled by default]
/home/XXX/drivers/20101216_RT3090_LinuxSTA_V2.4.0.4_WiFiBTCombo_DPO/os/linux/../../os/linux/cfg80211.c:1380:2: attention : (near initialization for ‘CFG80211_Ops.del_key’) [enabled by default]
/home/XXX/drivers/20101216_RT3090_LinuxSTA_V2.4.0.4_WiFiBTCombo_DPO/os/linux/../../os/linux/cfg80211.c:1381:2: attention : initialization from incompatible pointer type [enabled by default]
/home/XXX/drivers/20101216_RT3090_LinuxSTA_V2.4.0.4_WiFiBTCombo_DPO/os/linux/../../os/linux/cfg80211.c:1381:2: attention : (near initialization for ‘CFG80211_Ops.set_default_key’) [enabled by default]
/home/XXX/drivers/20101216_RT3090_LinuxSTA_V2.4.0.4_WiFiBTCombo_DPO/os/linux/../../os/linux/cfg80211.c:1388:2: attention : initialization from incompatible pointer type [enabled by default]
/home/XXX/drivers/20101216_RT3090_LinuxSTA_V2.4.0.4_WiFiBTCombo_DPO/os/linux/../../os/linux/cfg80211.c:1388:2: attention : (near initialization for ‘CFG80211_Ops.rfkill_poll’) [enabled by default]
/home/XXX/drivers/20101216_RT3090_LinuxSTA_V2.4.0.4_WiFiBTCombo_DPO/os/linux/../../os/linux/cfg80211.c: In function ‘CFG80211_Scaning’:
/home/XXX/drivers/20101216_RT3090_LinuxSTA_V2.4.0.4_WiFiBTCombo_DPO/os/linux/../../os/linux/cfg80211.c:2062:2: erreur: too few arguments to function ‘ieee80211_channel_to_frequency’
include/net/cfg80211.h:2224:12: note: declared here
/home/XXX/drivers/20101216_RT3090_LinuxSTA_V2.4.0.4_WiFiBTCombo_DPO/os/linux/../../os/linux/cfg80211.c: In function ‘CFG80211_SupBandInit’:
/home/XXX/drivers/20101216_RT3090_LinuxSTA_V2.4.0.4_WiFiBTCombo_DPO/os/linux/../../os/linux/cfg80211.c:2594:2: attention : format ‘%d’ expects argument of type ‘int’, but argument 2 has type ‘long unsigned int’ [-Wformat]
/home/XXX/drivers/20101216_RT3090_LinuxSTA_V2.4.0.4_WiFiBTCombo_DPO/os/linux/../../os/linux/cfg80211.c:2622:3: erreur: too few arguments to function ‘ieee80211_channel_to_frequency’
include/net/cfg80211.h:2224:12: note: declared here
make[2]: *** [/home/XXX/drivers/20101216_RT3090_LinuxSTA_V2.4.0.4_WiFiBTCombo_DPO/os/linux/../../os/linux/cfg80211.o] Erreur 1
make[1]: *** [_module_/home/XXX/drivers/20101216_RT3090_LinuxSTA_V2.4.0.4_WiFiBTCombo_DPO/os/linux] Erreur 2
make[1]: quittant le répertoire « /usr/src/linux-headers-3.2.0-26-generic »
make: *** [LINUX] Erreur 2
XXX@XXX-HP-ProBook-4525s:~/drivers/20101216_RT3090_LinuxSTA_V2.4.0.4_WiFiBTCombo_DPO$ 

Bah je tente d'installer le meme drivers via le .deb fait par markus
mais sans surprise c'est l'echec aussi !

Dépaquetage de rt3090-dkms (à partir de rt3090-dkms_2.4.0.4-0ubuntu0~ppa0_all.deb) ...
Paramétrage de rt3090-dkms (1:2.4.0.4-0ubuntu0~ppa0) ...
Adding Module to DKMS build system
Doing initial module build
ERROR (dkms apport): unable to determine source package for rt3090-dkms
Error! Bad return status for module build on kernel: 3.2.0-26-generic (x86_64)
Consult /var/lib/dkms/rt3090/2.4.0.4/build/make.log for more information.
Installing initial module
ERROR (dkms apport): unable to determine source package for rt3090-dkms
Error! Bad return status for module build on kernel: 3.2.0-26-generic (x86_64)
Consult /var/lib/dkms/rt3090/2.4.0.4/build/make.log for more information.
Done.

Les "erreur too few argument" ou "attention ...." divers et varié ont toujours été là avant !...je suis même étonné de n'avoir pas eu de pb avant au
vue du nombre de msg de ce genre . A croire qu'ils écrivent les drivers avec leur pied chez Ralink !
Mais au moins avant cela fonctionnait sans pb passé l'install !
Si quelqu'un a une idée ( euh ...Si votre avis c'est "attendre le kernel 3.2.0-27" ben ça je sais faire !
ceci dit je n'ai aucune garantie que cela change quelquechose ! )
Merci d'avoir lu jusque là !!

PS : je vais essayer d'envoyer un msg chez Ralink mais d'expérience je dirai que je n'aurai aucune réponse digne de ce nom !

Dernière modification par steve29 (Le 07/02/2013, à 13:02)


"Don't take life too seriously, you'll never get out of it alive."
Elbert HUBBARD (19/06/1856 - 07/05/1915) Poête-Philosophe-Ecrivain

Hors ligne

#2 Le 11/09/2012, à 16:04

steve29

Re : [ RESOLU] Erreur d'install drivers RALINK 3090pci apres MAJ Kernel

UPDATE

> PS : je vais essayer d'envoyer un msg chez Ralink mais d'expérience je dirai que je n'aurai aucune réponse digne de ce nom !

Aucune réponse de la part du support RALINK . J'en deduis que la réponse est :"debrouillez vous" .

On en est à la version 3.2.0.31 et de la version 26 à 31 de ce jour le résultat est le meme : echec de l'installation du driver.
Je reste donc bloque à la version 3.2.0.25 du Kernel de Xubuntu 12.04.

Je suis quand meme étonné de l'absence totale de reponse a mon thread , meme pas quelqu'un qui aurait reussi l'install..
Serai je le seul a posseder une Ralink RT3090 PCie sous X/Ubuntu ??????

Je m'oriente vers un changement de marque de chipset mais cette fois je vais poser la question sur le forum pour choisir un chipset wifi
avec la norme N et qui soit supporte en natif par le Kernel ubuntu ! ( Atheros ? )

Je flag en [NON RESOLU]


"Don't take life too seriously, you'll never get out of it alive."
Elbert HUBBARD (19/06/1856 - 07/05/1915) Poête-Philosophe-Ecrivain

Hors ligne

#3 Le 12/09/2012, à 20:03

goodsayan

Re : [ RESOLU] Erreur d'install drivers RALINK 3090pci apres MAJ Kernel

Je suis dans le meme cas que toi et j'ai pas la solution...

Hors ligne

#4 Le 24/10/2012, à 21:12

steve29

Re : [ RESOLU] Erreur d'install drivers RALINK 3090pci apres MAJ Kernel

goodsayan a écrit :

Je suis dans le meme cas que toi et j'ai pas la solution...

Ben aucune reponse de Ralink et on n'en est au kernel .33 sans solution en vue !
Navré je suis toujours bloque ! :^(


"Don't take life too seriously, you'll never get out of it alive."
Elbert HUBBARD (19/06/1856 - 07/05/1915) Poête-Philosophe-Ecrivain

Hors ligne

#5 Le 22/12/2012, à 14:53

steve29

Re : [ RESOLU] Erreur d'install drivers RALINK 3090pci apres MAJ Kernel

Un petit Up ...et quelques reflexions

Kernel 3.2.0.35 et probleme inchangé ...et RALINK est définitivement pas vraiment "linux-friendly" ..
des drivers plutôt mal écrit , de ce que je peux en voir !
Et un support client a chier, strictement aucune réponse alors que je sais désormais avec Goodsayan
(merci ! ) que le pb n'est pas dû a ma configuration .

Chipset a éviter ou alors a tester avant l'achat !! ..dommage quand il fonctionne il n'y a rien a dire sur les perf

Une question a tous, y a t il un utilisateur de ce chipset qui a reussi a faire fonctionner le WIfi avec une installation
propre de Xubuntu 12.10 ( pour l'instant je n'ai pas fait l'upgrade de peur de me heurte au pb du 3090pci :^(

Merci !


"Don't take life too seriously, you'll never get out of it alive."
Elbert HUBBARD (19/06/1856 - 07/05/1915) Poête-Philosophe-Ecrivain

Hors ligne

#6 Le 07/02/2013, à 12:59

steve29

Re : [ RESOLU] Erreur d'install drivers RALINK 3090pci apres MAJ Kernel

Ben ça y est j'ai trouve la solution . Elle etait assez simple en fait .....ne pas blacklister dans modprobe les drivers generic RT2800 et RT2x00
et mettre a la poubelle les drivers Ralink.
Je m'en suis rendu compte en lancant un livecd qui reconnait d'emblée la carte et en regardant les modules utilisés ..bingo.


"Don't take life too seriously, you'll never get out of it alive."
Elbert HUBBARD (19/06/1856 - 07/05/1915) Poête-Philosophe-Ecrivain

Hors ligne

#7 Le 14/05/2013, à 20:09

Ungars

Re : [ RESOLU] Erreur d'install drivers RALINK 3090pci apres MAJ Kernel

Bonjour, j' en suis au même niveau que toi, avec les mêmes erreurs de compilation.

mettre a la poubelle les drivers Ralink.

  Que dois tu rajouter dans modprobe dans ce cas ?
  Merci, bonne soirée.


Essaye désespérément d' installer une distribution Linux sur son Compaq CQ58
www.forum-plugcomputer.net

Hors ligne

  • Accueil
  • » Forum
  • » WiFi
  • » [ RESOLU] Erreur d'install drivers RALINK 3090pci apres MAJ Kernel

Haut de page ↑