#1501 Le 23/04/2007, à 18:59
- Doc cyco
Re : [Clos] Centralisation Probleme Webcam+EasyCam
Pour les personnes qui sont sous Ubuntu 6.10 et qui ont une webcam dans la liste suivante :
Philips PCA645VC
Philips PCA646VC
Philips PCVC675K "Vesta"
Philips PCVC680K "Vesta Pro"
Philips PCVC690K "Vesta Scan"
Philips PCVC720K/PCVC740K "ToUCam XS"
Philips PCVC730K "ToUCam Fun"
Philips PCVC740K "ToUCam Pro"
Philips PCVC750K "ToUCam Scan"
Philips PCVC830K "ToUCam Fun II"
Philips PCVC840K "ToUCam Pro II"
Askey VC010
Creative Labs Webcam Pro Ex
Logitech QuickCam 3000 Pro
Logitech QuickCam 4000 Pro
Logitech QuickCam Notebook Pro (WARNING: new models with USB ID 046d:08c3 do not work!)
Logitech QuickCam Zoom
Logitech QuickCam Orbit/Sphere
Samsung MPC-C10
Samsung MPC-C30
Sotec Afina Eye
Visionite VCS UM100
Visionite VCS UC300C'est trés simple. N'installez pas easycam ou easycam2 (ca marcheras pas avec Ubuntu 6.10)
1) télécharger le fichier http://www.saillard.org/linux/pwc/files/pwc-10.0.12-rc1.tar.bz2
Téléchargez le driver sur http://www.saillard.org/linux/pwc/files/
Le fichier est pwc-10.0.12-rc1.tar.bz2
Démarrer une invite de commande et placez-vous dans le dossier de l'archive.2) décompresser le fichier par la commande:
tar xjf pwc-10.0.12-rc1.tar.bz23) compiler le module (si on dispose des sources du kernel actuels)
cd pwc-10.0.21-rc1
make4) passer sous l'utilisateur root
sudo -s5) Si une version précédente du module a deja ete installer, lancer la commande suivante pour effacer le module.
find /lib/modules/`uname -r`/ -name "pwc*.ko*"
rm <nom du fichier.ko>6) Copier le nouveau modules sur l'ancien
make install7) Décharger le module ou rebooter la machine
rmmod pwc
rmmod pwcx
modprobe pwcvivien@cf5:~/webcam/pwc-10.0.12-rc1$ sudo -s root@cf5:~/webcam/pwc-10.0.12-rc1# uname -r 2.6.17-11-generic root@cf5:~/webcam/pwc-10.0.12-rc1# find /lib/modules/2.6.17-11-generic/ -name "pwc*.ko*" /lib/modules/2.6.17-11-generic/kernel/drivers/media/video/pwc/pwc.ko root@cf5:~/webcam/pwc-10.0.12-rc1# rm /lib/modules/2.6.17-11-generic/kernel/drivers/media/video/pwc/pwc.ko root@cf5:~/webcam/pwc-10.0.12-rc1# make install make -C /lib/modules/2.6.17-11-generic/build SUBDIRS=/home/vgu/webcam/pwc-10.0.12-rc1 modules make[1]: entrant dans le répertoire « /usr/src/linux-headers-2.6.17-11-generic » Building modules, stage 2. MODPOST make[1]: quittant le répertoire « /usr/src/linux-headers-2.6.17-11-generic » install -d /lib/modules/2.6.17-11-generic/kernel/drivers/usb/media install -m 644 -c pwc.ko /lib/modules/2.6.17-11-generic/kernel/drivers/usb/media /sbin/depmod -a root@cf5:~/webcam/pwc-10.0.12-rc1# rmmod pwc ERROR: Module pwc does not exist in /proc/modules root@cf5:~/webcam/pwc-10.0.12-rc1# rmmod pwcx ERROR: Module pwcx does not exist in /proc/modules root@cf5:~/webcam/pwc-10.0.12-rc1# modprobe pwc
Après, pour vérifier, j'ai simplement démarré VLC => Fichier => Ouvrir un périphérique de capture => OK et cela marchais !
La version de aMSN proposée dans les dépà´ts (0.95) supporte la Webcam en théorie mais en pratique pas avec ces drivers => il faut l'installer d'abord installer la 0.95 via synaptique pour installer les dépendances, puis la désinstaller, puis installer la dernière version (0.96) trouvée sur http://www.amsn-project.net/linux-downloads.php
L'installation est trés simple. (rendez exécutable le script téléchargé et excutez le puis suivez les instructions à l'écran en français)
Etant seul je n'ai pas eu besoin ce problèmes mais Yves-Antoine a un truc qui pourras aider :
Après cela fonctionnait sour mon login, mais pas sous celui des enfants !!! Ceci était dû aux permissions du device /dev/video0 crw-rw---- root video
J'appartenais bien au groupe video, mais pas les enfants (mon login est celui renseigné dans l'installation d'ubuntu et celui qui a fait toutes les installations). Mais la gestion utilisateurs de Gnome (Système > Administration > Utilisateurs et groupes) ne liste pas video dans la liste de rà´les... Il faut donc pour chaque utilisateur :
- passer une commande id <login> pour connaà®tre sa liste de groupes
- passer la command sudo usermod avec l'option -G répétant la liste de groupes et en ajoutant le groupe video, par exemple :
sudo usermod -G yae,adm,dialout,cdrom,floppy,audio,dip,video,plugdev,lpadmin,scanner,admin marcUn grand merci au post d'Yves-Antoine (dont j'ai repris des morceaux ici) qui ma permis de faire fonctionner ma webcam.
Vivien.
Salut, le make ne marche pas pour moi....
Dernière modification par Doc cyco (Le 08/04/2008, à 13:12)
Hors ligne
#1502 Le 25/04/2007, à 09:42
- Sbeb
Re : [Clos] Centralisation Probleme Webcam+EasyCam
Bonjour à tous.
Je viens de faire l'acquisition d'une hercules deluxe pensant qu'elle fonctionnerait au vu des différents résultats positif glanés sur le net. Malheureusement ce n'est pas le cas chez moi ...
Avec easycam2, il me détecte ma webcam, mais n'arrive pas à l'installer. La première erreur lors du make est :
/usr/share/EasyCam2/drivers/ov51x/ov51x.c:42:26: erreur: linux/config.h : Aucun fichier ou répertoire de ce type
Je précise que je suis sous Feisty ... tous les messages que j'ai pu voir sur le net parlaient d'une install réussie sous dapper ou breezy voir pour certain sous edgy, mais personne pour feisty. Quelqu'un aurait il réussi ?
Merci de votre aide. Je suis à votre disposition pour d'éventuelles questions.
Sbeb
Dernière modification par Sbeb (Le 25/04/2007, à 11:22)
That is not dead which can eternal lie,
And with strange aeon's even death may die.
Hors ligne
#1503 Le 25/04/2007, à 09:59
- eridan
Re : [Clos] Centralisation Probleme Webcam+EasyCam
pour ma part je possède cette webcam!
j'ai réussi à la faire fonctionner sous edjy (chez un pote)mais pas sur ma machine avec Dapper ou Elive et pourtant je me suis creusé la tête!!!
En désespoir de cause j'ai ressorti de mes cartons un APN Lifetec "pencam" branchée avec Dapper elle marche du premier coup sans rien faire.... va comprendre!
@+?
Y, s'crois où les gens?
Hors ligne
#1504 Le 25/04/2007, à 12:17
- Mantacool
Re : [Clos] Centralisation Probleme Webcam+EasyCam
Ah les webcams sou linux ...
Mais ça va venir ...
Ca pred juste l temps que les fabricans s'éloignet un peu de Microsoft.
Et comme en ce moment ils ont des pbs avec les drivers Vista .... imaginez Linux ...
Hors ligne
#1505 Le 25/04/2007, à 23:31
- fanfantasy7
Re : [Clos] Centralisation Probleme Webcam+EasyCam
Bonsoir
lsusb
me donne
Bus 002 Device 004: ID 0471:0311 Philips PCVC740K ToUcam Pro [pwc]
je suis sous feisty 7.04
mais je n'ai pas de video0 dans /dev/
la commande
lsmod | grep pwc
ne me renvoie rien
alors qu'elle devrai me dire si pwc est bien installé
merci de m'aider
Bertrand
Fanfantasy7
pc fixe : Linux Mint
pc portable : Ubuntu LTS
Hors ligne
#1506 Le 25/04/2007, à 23:48
- Sbeb
Re : [Clos] Centralisation Probleme Webcam+EasyCam
Bon, j'ai un peu progressé (pas beaucoup !).
J'ai créé le lien suivant :
sudo ln -s /usr/src/linux-headers-2.6.20-15-generic/include/linux/autoconf.h /usr/src/linux-headers-2.6.20-15-generic/include/linux/config.h
Et du coup, j'ai réussi à passer une étape
Mais ça bloque à nouveau :
sudo lauchcam2
Lecture des listes de paquets... Fait
Construction de l'arbre des dépendances
Lecture de l'information d'état... Fait
linux-headers-2.6.20-15-generic est déjà la plus récente version disponible.
0 mis à jour, 0 nouvellement installés, 0 à enlever et 0 non mis à jour.
ln: création d'un lien symbolique `/lib/modules/2.6.20-15-generic/build/linux-headers-2.6.20-15-generic' vers `/usr/src/linux-headers-2.6.20-15-generic': Le fichier existe.
ERROR: Module ov518_decomp does not exist in /proc/modules
ERROR: Module ov51x does not exist in /proc/modules
mkdir: ne peut créer le répertoire `/lib/modules/2.6.20-15-generic/kernel/drivers/usb/media-back': Le fichier existe.
cp: ne peut évaluer `/lib/modules/2.6.20-15-generic/kernel/drivers/usb/media/*': Aucun fichier ou répertoire de ce type
cd: 1: can't cd to /lib/modules/2.6.20-15-generic/kernel/drivers/usb/media/
mknod: `/dev/video0': Le fichier existe.
mknod: `/dev/video1': Le fichier existe.
ln: création d'un lien symbolique `/dev/video' vers `/dev/video0': Le fichier existe.
make -C /lib/modules/2.6.20-15-generic/build M=/usr/share/EasyCam2/drivers/ov51x clean
make[1]: entrant dans le répertoire « /usr/src/linux-headers-2.6.20-15-generic »
CLEAN /usr/share/EasyCam2/drivers/ov51x/.tmp_versions
make[1]: quittant le répertoire « /usr/src/linux-headers-2.6.20-15-generic »
make -C /lib/modules/2.6.20-15-generic/build M=/usr/share/EasyCam2/drivers/ov51x modules
make[1]: entrant dans le répertoire « /usr/src/linux-headers-2.6.20-15-generic »
CC [M] /usr/share/EasyCam2/drivers/ov51x/ov51x.o
/usr/share/EasyCam2/drivers/ov51x/ov51x.c:207: erreur: expected ‘)’ before string constant
/usr/share/EasyCam2/drivers/ov51x/ov51x.c:209: erreur: expected ‘)’ before string constant
/usr/share/EasyCam2/drivers/ov51x/ov51x.c:211: erreur: expected ‘)’ before string constant
/usr/share/EasyCam2/drivers/ov51x/ov51x.c:213: erreur: expected ‘)’ before string constant
/usr/share/EasyCam2/drivers/ov51x/ov51x.c:216: erreur: expected ‘)’ before string constant
/usr/share/EasyCam2/drivers/ov51x/ov51x.c:220: erreur: expected ‘)’ before string constant
/usr/share/EasyCam2/drivers/ov51x/ov51x.c:223: erreur: expected ‘)’ before string constant
/usr/share/EasyCam2/drivers/ov51x/ov51x.c:227: erreur: expected ‘)’ before string constant
/usr/share/EasyCam2/drivers/ov51x/ov51x.c:229: erreur: expected ‘)’ before string constant
/usr/share/EasyCam2/drivers/ov51x/ov51x.c:231: erreur: expected ‘)’ before string constant
/usr/share/EasyCam2/drivers/ov51x/ov51x.c:234: erreur: expected ‘)’ before string constant
/usr/share/EasyCam2/drivers/ov51x/ov51x.c:236: erreur: expected ‘)’ before string constant
/usr/share/EasyCam2/drivers/ov51x/ov51x.c:239: erreur: expected ‘)’ before string constant
/usr/share/EasyCam2/drivers/ov51x/ov51x.c:242: erreur: expected ‘)’ before string constant
/usr/share/EasyCam2/drivers/ov51x/ov51x.c:244: erreur: expected ‘)’ before string constant
/usr/share/EasyCam2/drivers/ov51x/ov51x.c:246: erreur: expected ‘)’ before string constant
/usr/share/EasyCam2/drivers/ov51x/ov51x.c:248: erreur: expected ‘)’ before string constant
/usr/share/EasyCam2/drivers/ov51x/ov51x.c:250: erreur: expected ‘)’ before string constant
/usr/share/EasyCam2/drivers/ov51x/ov51x.c:252: erreur: expected ‘)’ before string constant
/usr/share/EasyCam2/drivers/ov51x/ov51x.c:254: erreur: expected ‘)’ before string constant
/usr/share/EasyCam2/drivers/ov51x/ov51x.c:256: erreur: expected ‘)’ before string constant
/usr/share/EasyCam2/drivers/ov51x/ov51x.c:258: erreur: expected ‘)’ before string constant
/usr/share/EasyCam2/drivers/ov51x/ov51x.c:260: erreur: expected ‘)’ before string constant
/usr/share/EasyCam2/drivers/ov51x/ov51x.c:262: erreur: expected ‘)’ before string constant
/usr/share/EasyCam2/drivers
That is not dead which can eternal lie,
And with strange aeon's even death may die.
Hors ligne
#1507 Le 25/04/2007, à 23:52
- Sbeb
Re : [Clos] Centralisation Probleme Webcam+EasyCam
Tiens mon message à été tronqué ! Il manque la fin du log d'erreur.
Je poste la fin :
/usr/share/EasyCam2/drivers/ov51x/ov51x.c:264: erreur: expected ‘)’ before string constant
/usr/share/EasyCam2/drivers/ov51x/ov51x.c:267: erreur: expected ‘)’ before string constant
/usr/share/EasyCam2/drivers/ov51x/ov51x.c:270: erreur: expected ‘)’ before string constant
/usr/share/EasyCam2/drivers/ov51x/ov51x.c:272: erreur: expected ‘)’ before string constant
/usr/share/EasyCam2/drivers/ov51x/ov51x.c:274: erreur: expected ‘)’ before string constant
/usr/share/EasyCam2/drivers/ov51x/ov51x.c:276: erreur: expected ‘)’ before string constant
/usr/share/EasyCam2/drivers/ov51x/ov51x.c:278: erreur: expected ‘)’ before string constant
/usr/share/EasyCam2/drivers/ov51x/ov51x.c:280: erreur: expected ‘)’ before string constant
/usr/share/EasyCam2/drivers/ov51x/ov51x.c:282: erreur: expected ‘)’ before string constant
/usr/share/EasyCam2/drivers/ov51x/ov51x.c:285: erreur: expected ‘)’ before string constant
/usr/share/EasyCam2/drivers/ov51x/ov51x.c:288: erreur: expected ‘)’ before string constant
/usr/share/EasyCam2/drivers/ov51x/ov51x.c:290: erreur: expected ‘)’ before string constant
/usr/share/EasyCam2/drivers/ov51x/ov51x.c:292: erreur: expected ‘)’ before string constant
/usr/share/EasyCam2/drivers/ov51x/ov51x.c:294: erreur: expected ‘)’ before string constant
/usr/share/EasyCam2/drivers/ov51x/ov51x.c: In function ‘ov51x_init_isoc’:
/usr/share/EasyCam2/drivers/ov51x/ov51x.c:5449: attention : assignment from incompatible pointer type
/usr/share/EasyCam2/drivers/ov51x/ov51x.c: In function ‘ov51x_v4l1_open’:
/usr/share/EasyCam2/drivers/ov51x/ov51x.c:5705: attention : implicit declaration of function ‘video_devdata’
/usr/share/EasyCam2/drivers/ov51x/ov51x.c:5705: attention : initialization makes pointer from integer without a cast
/usr/share/EasyCam2/drivers/ov51x/ov51x.c:5707: attention : implicit declaration of function ‘video_get_drvdata’
/usr/share/EasyCam2/drivers/ov51x/ov51x.c:5707: attention : initialization makes pointer from integer without a cast
/usr/share/EasyCam2/drivers/ov51x/ov51x.c: In function ‘ov51x_v4l1_close’:
/usr/share/EasyCam2/drivers/ov51x/ov51x.c:5784: attention : initialization makes pointer from integer without a cast
/usr/share/EasyCam2/drivers/ov51x/ov51x.c: In function ‘ov51x_v4l1_ioctl_internal’:
/usr/share/EasyCam2/drivers/ov51x/ov51x.c:5842: attention : initialization makes pointer from integer without a cast
/usr/share/EasyCam2/drivers/ov51x/ov51x.c:6246: erreur: déréférencement d'un pointeur de type incomplet
/usr/share/EasyCam2/drivers/ov51x/ov51x.c: In function ‘ov51x_v4l1_ioctl’:
/usr/share/EasyCam2/drivers/ov51x/ov51x.c:6358: attention : initialization makes pointer from integer without a cast
/usr/share/EasyCam2/drivers/ov51x/ov51x.c:6364: attention : implicit declaration of function ‘video_usercopy’
/usr/share/EasyCam2/drivers/ov51x/ov51x.c: In function ‘ov51x_v4l1_read’:
/usr/share/EasyCam2/drivers/ov51x/ov51x.c:6384: attention : initialization makes pointer from integer without a cast
/usr/share/EasyCam2/drivers/ov51x/ov51x.c: In function ‘ov51x_v4l1_mmap’:
/usr/share/EasyCam2/drivers/ov51x/ov51x.c:6554: attention : initialization makes pointer from integer without a cast
/usr/share/EasyCam2/drivers/ov51x/ov51x.c: Hors de toute fonction :
/usr/share/EasyCam2/drivers/ov51x/ov51x.c:6625: erreur: variable ‘vdev_template’ has initializer but incomplete type
/usr/share/EasyCam2/drivers/ov51x/ov51x.c:6626: erreur: unknown field ‘owner’ specified in initializer
/usr/share/EasyCam2/drivers/ov51x/ov51x.c:6626: attention : éléments en excès dans l'initialisation de la structure
/usr/share/EasyCam2/drivers/ov51x/ov51x.c:6626: attention : (near initialization for ‘vdev_template’)
/usr/share/EasyCam2/drivers/ov51x/ov51x.c:6627: erreur: unknown field ‘name’ specified in initializer
/usr/share/EasyCam2/drivers/ov51x/ov51x.c:6627: attention : éléments en excès dans l'initialisation de la structure
/usr/share/EasyCam2/drivers/ov51x/ov51x.c:6627: attention : (near initialization for ‘vdev_template’)
/usr/share/EasyCam2/drivers/ov51x/ov51x.c:6628: erreur: unknown field ‘type’ specified in initializer
/usr/share/EasyCam2/drivers/ov51x/ov51x.c:6628: attention : éléments en excès dans l'initialisation de la structure
/usr/share/EasyCam2/drivers/ov51x/ov51x.c:6628: attention : (near initialization for ‘vdev_template’)
/usr/share/EasyCam2/drivers/ov51x/ov51x.c:6629: erreur: unknown field ‘hardware’ specified in initializer
/usr/share/EasyCam2/drivers/ov51x/ov51x.c:6629: attention : éléments en excès dans l'initialisation de la structure
/usr/share/EasyCam2/drivers/ov51x/ov51x.c:6629: attention : (near initialization for ‘vdev_template’)
/usr/share/EasyCam2/drivers/ov51x/ov51x.c:6630: erreur: unknown field ‘fops’ specified in initializer
/usr/share/EasyCam2/drivers/ov51x/ov51x.c:6630: attention : éléments en excès dans l'initialisation de la structure
/usr/share/EasyCam2/drivers/ov51x/ov51x.c:6630: attention : (near initialization for ‘vdev_template’)
/usr/share/EasyCam2/drivers/ov51x/ov51x.c:6632: erreur: unknown field ‘release’ specified in initializer
/usr/share/EasyCam2/drivers/ov51x/ov51x.c:6632: erreur: ‘video_device_release’ undeclared here (not in a function)
/usr/share/EasyCam2/drivers/ov51x/ov51x.c:6632: attention : éléments en excès dans l'initialisation de la structure
/usr/share/EasyCam2/drivers/ov51x/ov51x.c:6632: attention : (near initialization for ‘vdev_template’)
/usr/share/EasyCam2/drivers/ov51x/ov51x.c:6634: erreur: unknown field ‘minor’ specified in initializer
/usr/share/EasyCam2/drivers/ov51x/ov51x.c:6634: attention : éléments en excès dans l'initialisation de la structure
/usr/share/EasyCam2/drivers/ov51x/ov51x.c:6634: attention : (near initialization for ‘vdev_template’)
/usr/share/EasyCam2/drivers/ov51x/ov51x.c: In function ‘ov51x_probe’:
/usr/share/EasyCam2/drivers/ov51x/ov51x.c:8298: attention : implicit declaration of function ‘video_device_alloc’
/usr/share/EasyCam2/drivers/ov51x/ov51x.c:8298: attention : assignment makes pointer from integer without a cast
/usr/share/EasyCam2/drivers/ov51x/ov51x.c:8302: erreur: déréférencement d'un pointeur de type incomplet
/usr/share/EasyCam2/drivers/ov51x/ov51x.c:8302: erreur: déréférencement d'un pointeur de type incomplet
/usr/share/EasyCam2/drivers/ov51x/ov51x.c:8302: erreur: déréférencement d'un pointeur de type incomplet
/usr/share/EasyCam2/drivers/ov51x/ov51x.c:8304: erreur: déréférencement d'un pointeur de type incomplet
/usr/share/EasyCam2/drivers/ov51x/ov51x.c:8306: attention : implicit declaration of function ‘video_set_drvdata’
/usr/share/EasyCam2/drivers/ov51x/ov51x.c:8314: attention : implicit declaration of function ‘video_register_device’
/usr/share/EasyCam2/drivers/ov51x/ov51x.c:8314: erreur: ‘VFL_TYPE_GRABBER’ undeclared (first use in this function)
/usr/share/EasyCam2/drivers/ov51x/ov51x.c:8314: erreur: (Each undeclared identifier is reported only once
/usr/share/EasyCam2/drivers/ov51x/ov51x.c:8314: erreur: for each function it appears in.)
/usr/share/EasyCam2/drivers/ov51x/ov51x.c:8321: erreur: déréférencement d'un pointeur de type incomplet
/usr/share/EasyCam2/drivers/ov51x/ov51x.c:8331: erreur: déréférencement d'un pointeur de type incomplet
/usr/share/EasyCam2/drivers/ov51x/ov51x.c:8354: erreur: déréférencement d'un pointeur de type incomplet
/usr/share/EasyCam2/drivers/ov51x/ov51x.c:8355: attention : implicit declaration of function ‘video_device_release’
/usr/share/EasyCam2/drivers/ov51x/ov51x.c:8357: attention : implicit declaration of function ‘video_unregister_device’
/usr/share/EasyCam2/drivers/ov51x/ov51x.c: Hors de toute fonction :
/usr/share/EasyCam2/drivers/ov51x/ov51x.c:8464: erreur: unknown field ‘owner’ specified in initializer
/usr/share/EasyCam2/drivers/ov51x/ov51x.c:8464: attention : initialization from incompatible pointer type
make[2]: *** [/usr/share/EasyCam2/drivers/ov51x/ov51x.o] Erreur 1
make[1]: *** [_module_/usr/share/EasyCam2/drivers/ov51x] Erreur 2
make[1]: quittant le répertoire « /usr/src/linux-headers-2.6.20-15-generic »
make: *** [all] Erreur 2
Et donc je disais que je ne me décourageais pas, mais là ça dépasse mes modestes compétences en C !
That is not dead which can eternal lie,
And with strange aeon's even death may die.
Hors ligne
#1508 Le 27/04/2007, à 12:32
- bbmaster_retour
Re : [Clos] Centralisation Probleme Webcam+EasyCam
salut,
moi, j'installe une cam logiteck messenger
il me dit que il y a un problème lors de make install
Merci
#1509 Le 27/04/2007, à 12:36
- bbmaster
Re : [Clos] Centralisation Probleme Webcam+EasyCam
re(c'est moi bbmaster_retour mais j'avais oublier mon mot de pass)
quand je fait lauchcam2 j'ai un log
ERROR: Module quickcam does not exist in /proc/modules
mkdir: ne peut créer le répertoire `/lib/modules/2.6.20-15-386/kernel/drivers/usb/media-back': Le fichier existe.
cp: ne peut évaluer `/lib/modules/2.6.20-15-386/kernel/drivers/usb/media/*': Aucun fichier ou répertoire de ce type
cd: 1: can't cd to /lib/modules/2.6.20-15-386/kernel/drivers/usb/media/
mknod: `/dev/video0': Le fichier existe.
mknod: `/dev/video1': Le fichier existe.
ln: création d'un lien symbolique `/dev/video' vers `/dev/video0': Le fichier existe.
rm -f *.o qcset input_read show *~ .\#* .*.cmd *.mod.c *.ko
rm -rf .tmp_versions
cd testquickcam ; make clean
make[1]: entrant dans le répertoire « /usr/share/EasyCam2/drivers/qcnews/testquickcam »
rm -f testquickcam *~ pic.ppm pic.gif
make[1]: quittant le répertoire « /usr/share/EasyCam2/drivers/qcnews/testquickcam »
make -C "/lib/modules/2.6.20-15-386/build" SUBDIRS="/usr/share/EasyCam2/drivers/qcnews" modules V=1 USER_OPT=""
make[1]: entrant dans le répertoire « /usr/src/linux-headers-2.6.20-15-386 »
test -e include/linux/autoconf.h -a -e include/config/auto.conf || ( \
echo; \
echo " ERROR: Kernel configuration is invalid."; \
echo " include/linux/autoconf.h or include/config/auto.conf are missing."; \
echo " Run 'make oldconfig && make prepare' on kernel src to fix it."; \
echo; \
/bin/false)
mkdir -p /usr/share/EasyCam2/drivers/qcnews/.tmp_versions
rm -f /usr/share/EasyCam2/drivers/qcnews/.tmp_versions/*
make -f scripts/Makefile.build obj=/usr/share/EasyCam2/drivers/qcnews
gcc -m32 -Wp,-MD,/usr/share/EasyCam2/drivers/qcnews/.qc-driver.o.d -nostdinc -isystem /usr/lib/gcc/i486-linux-gnu/4.1.2/include -D__KERNEL__ -Iinclude -include include/linux/autoconf.h -Iubuntu/include -Wall -Wundef -Wstrict-prototypes -Wno-trigraphs -fno-strict-aliasing -fno-common -O2 -pipe -msoft-float -mregparm=3 -mpreferred-stack-boundary=2 -march=i486 -mtune=generic -ffreestanding -maccumulate-outgoing-args -Iinclude/asm-i386/mach-default -fomit-frame-pointer -g -fno-stack-protector -Wdeclaration-after-statement -Wno-pointer-sign -DNOKERNEL -DMODULE -D"KBUILD_STR(s)=#s" -D"KBUILD_BASENAME=KBUILD_STR(qc_driver)" -D"KBUILD_MODNAME=KBUILD_STR(quickcam)" -c -o /usr/share/EasyCam2/drivers/qcnews/.tmp_qc-driver.o /usr/share/EasyCam2/drivers/qcnews/qc-driver.c
Dans le fichier inclus à partir de /usr/share/EasyCam2/drivers/qcnews/qc-driver.c:47:
/usr/share/EasyCam2/drivers/qcnews/quickcam.h:93:26: erreur: linux/config.h : Aucun fichier ou répertoire de ce type
In file included from /usr/share/EasyCam2/drivers/qcnews/qc-driver.c:47:
/usr/share/EasyCam2/drivers/qcnews/quickcam.h:550: erreur: field ‘vdev’ has incomplete type
/usr/share/EasyCam2/drivers/qcnews/qc-driver.c:82: erreur: expected ‘)’ before string constant
/usr/share/EasyCam2/drivers/qcnews/qc-driver.c:86: erreur: expected ‘)’ before string constant
/usr/share/EasyCam2/drivers/qcnews/qc-driver.c:90: erreur: expected ‘)’ before string constant
/usr/share/EasyCam2/drivers/qcnews/qc-driver.c:95: erreur: expected ‘)’ before string constant
/usr/share/EasyCam2/drivers/qcnews/qc-driver.c:99: erreur: expected ‘)’ before string constant
/usr/share/EasyCam2/drivers/qcnews/qc-driver.c:103: erreur: expected ‘)’ before string constant
/usr/share/EasyCam2/drivers/qcnews/qc-driver.c:107: erreur: expected ‘)’ before string constant
/usr/share/EasyCam2/drivers/qcnews/qc-driver.c:111: erreur: expected ‘)’ before string constant
/usr/share/EasyCam2/drivers/qcnews/qc-driver.c:115: erreur: expected ‘)’ before string constant
/usr/share/EasyCam2/drivers/qcnews/qc-driver.c:119: erreur: expected ‘)’ before string constant
/usr/share/EasyCam2/drivers/qcnews/qc-driver.c:123: erreur: expected ‘)’ before string constant
/usr/share/EasyCam2/drivers/qcnews/qc-driver.c:134: erreur: expected ‘)’ before string constant
/usr/share/EasyCam2/drivers/qcnews/qc-driver.c:139: erreur: expected ‘)’ before string constant
/usr/share/EasyCam2/drivers/qcnews/qc-driver.c:144: erreur: expected ‘)’ before string constant
/usr/share/EasyCam2/drivers/qcnews/qc-driver.c: In function ‘qc_int_init’:
/usr/share/EasyCam2/drivers/qcnews/qc-driver.c:748: attention : passing argument 6 of ‘usb_fill_int_urb’ from incompatible pointer type
/usr/share/EasyCam2/drivers/qcnews/qc-driver.c: In function ‘qc_proc_read’:
/usr/share/EasyCam2/drivers/qcnews/qc-driver.c:854: erreur: ‘UTS_RELEASE’ undeclared (first use in this function)
/usr/share/EasyCam2/drivers/qcnews/qc-driver.c:854: erreur: (Each undeclared identifier is reported only once
/usr/share/EasyCam2/drivers/qcnews/qc-driver.c:854: erreur: for each function it appears in.)
/usr/share/EasyCam2/drivers/qcnews/qc-driver.c: In function ‘qc_isoc_start’:
/usr/share/EasyCam2/drivers/qcnews/qc-driver.c:2093: attention : assignment from incompatible pointer type
/usr/share/EasyCam2/drivers/qcnews/qc-driver.c: In function ‘qc_v4l_poll’:
/usr/share/EasyCam2/drivers/qcnews/qc-driver.c:2503: attention : implicit declaration of function ‘video_devdata’
/usr/share/EasyCam2/drivers/qcnews/qc-driver.c:2503: attention : initialization makes pointer from integer without a cast
/usr/share/EasyCam2/drivers/qcnews/qc-driver.c:2505: erreur: déréférencement d'un pointeur de type incomplet
/usr/share/EasyCam2/drivers/qcnews/qc-driver.c: In function ‘qc_v4l_open’:
/usr/share/EasyCam2/drivers/qcnews/qc-driver.c:2555: attention : initialization makes pointer from integer without a cast
/usr/share/EasyCam2/drivers/qcnews/qc-driver.c:2557: erreur: déréférencement d'un pointeur de type incomplet
/usr/share/EasyCam2/drivers/qcnews/qc-driver.c: In function ‘qc_v4l_close’:
/usr/share/EasyCam2/drivers/qcnews/qc-driver.c:2620: attention : initialization makes pointer from integer without a cast
/usr/share/EasyCam2/drivers/qcnews/qc-driver.c:2622: erreur: déréférencement d'un pointeur de type incomplet
/usr/share/EasyCam2/drivers/qcnews/qc-driver.c: In function ‘qc_v4l_read’:
/usr/share/EasyCam2/drivers/qcnews/qc-driver.c:2668: attention : initialization makes pointer from integer without a cast
/usr/share/EasyCam2/drivers/qcnews/qc-driver.c:2671: erreur: déréférencement d'un pointeur de type incomplet
/usr/share/EasyCam2/drivers/qcnews/qc-driver.c: In function ‘qc_v4l_mmap’:
/usr/share/EasyCam2/drivers/qcnews/qc-driver.c:2724: attention : initialization makes pointer from integer without a cast
/usr/share/EasyCam2/drivers/qcnews/qc-driver.c:2728: erreur: déréférencement d'un pointeur de type incomplet
/usr/share/EasyCam2/drivers/qcnews/qc-driver.c: In function ‘qc_v4l_ioctl’:
/usr/share/EasyCam2/drivers/qcnews/qc-driver.c:2757: attention : initialization makes pointer from integer without a cast
/usr/share/EasyCam2/drivers/qcnews/qc-driver.c:2760: erreur: déréférencement d'un pointeur de type incomplet
/usr/share/EasyCam2/drivers/qcnews/qc-driver.c: Hors de toute fonction :
/usr/share/EasyCam2/drivers/qcnews/qc-driver.c:3353: erreur: variable ‘qc_v4l_template’ has initializer but incomplete type
/usr/share/EasyCam2/drivers/qcnews/qc-driver.c:3354: erreur: unknown field ‘name’ specified in initializer
/usr/share/EasyCam2/drivers/qcnews/qc-driver.c:3354: attention : éléments en excès dans l'initialisation de la structure
/usr/share/EasyCam2/drivers/qcnews/qc-driver.c:3354: attention : (near initialization for ‘qc_v4l_template’)
/usr/share/EasyCam2/drivers/qcnews/qc-driver.c:3355: erreur: unknown field ‘type’ specified in initializer
/usr/share/EasyCam2/drivers/qcnews/qc-driver.c:3355: attention : éléments en excès dans l'initialisation de la structure
/usr/share/EasyCam2/drivers/qcnews/qc-driver.c:3355: attention : (near initialization for ‘qc_v4l_template’)
/usr/share/EasyCam2/drivers/qcnews/qc-driver.c:3356: erreur: unknown field ‘hardware’ specified in initializer
/usr/share/EasyCam2/drivers/qcnews/qc-driver.c:3356: attention : éléments en excès dans l'initialisation de la structure
/usr/share/EasyCam2/drivers/qcnews/qc-driver.c:3356: attention : (near initialization for ‘qc_v4l_template’)
/usr/share/EasyCam2/drivers/qcnews/qc-driver.c:3357: erreur: unknown field ‘minor’ specified in initializer
/usr/share/EasyCam2/drivers/qcnews/qc-driver.c:3357: attention : éléments en excès dans l'initialisation de la structure
/usr/share/EasyCam2/drivers/qcnews/qc-driver.c:3357: attention : (near initialization for ‘qc_v4l_template’)
/usr/share/EasyCam2/drivers/qcnews/qc-driver.c:3359: erreur: unknown field ‘release’ specified in initializer
/usr/share/EasyCam2/drivers/qcnews/qc-driver.c:3359: attention : éléments en excès dans l'initialisation de la structure
/usr/share/EasyCam2/drivers/qcnews/qc-driver.c:3359: attention : (near initialization for ‘qc_v4l_template’)
/usr/share/EasyCam2/drivers/qcnews/qc-driver.c:3360: erreur: unknown field ‘fops’ specified in initializer
/usr/share/EasyCam2/drivers/qcnews/qc-driver.c:3360: attention : éléments en excès dans l'initialisation de la structure
/usr/share/EasyCam2/drivers/qcnews/qc-driver.c:3360: attention : (near initialization for ‘qc_v4l_template’)
/usr/share/EasyCam2/drivers/qcnews/qc-driver.c:3393: erreur: unknown field ‘owner’ specified in initializer
/usr/share/EasyCam2/drivers/qcnews/qc-driver.c:3393: attention : initialization from incompatible pointer type
/usr/share/EasyCam2/drivers/qcnews/qc-driver.c: In function ‘qc_usb_init’:
/usr/share/EasyCam2/drivers/qcnews/qc-driver.c:3614: erreur: invalid application of ‘sizeof’ to incomplete type ‘struct video_device’
/usr/share/EasyCam2/drivers/qcnews/qc-driver.c:3614: erreur: invalid application of ‘sizeof’ to incomplete type ‘struct video_device’
/usr/share/EasyCam2/drivers/qcnews/qc-driver.c:3614: erreur: invalid application of ‘sizeof’ to incomplete type ‘struct video_device’
/usr/share/EasyCam2/drivers/qcnews/qc-driver.c:3618: attention : implicit declaration of function ‘video_register_device’
/usr/share/EasyCam2/drivers/qcnews/qc-driver.c:3618: erreur: ‘VFL_TYPE_GRABBER’ undeclared (first use in this function)
/usr/share/EasyCam2/drivers/qcnews/qc-driver.c:3654: attention : implicit declaration of function ‘video_unregister_device’
/usr/share/EasyCam2/drivers/qcnews/qc-driver.c: In function ‘qc_usb_probe’:
/usr/share/EasyCam2/drivers/qcnews/qc-driver.c:3833: erreur: ‘UTS_RELEASE’ undeclared (first use in this function)
make[2]: *** [/usr/share/EasyCam2/drivers/qcnews/qc-driver.o] Erreur 1
make[1]: *** [_module_/usr/share/EasyCam2/drivers/qcnews] Erreur 2
make[1]: quittant le répertoire « /usr/src/linux-headers-2.6.20-15-386 »
make: *** [quickcam.ko] Erreur 2
voila (le tout en root)
Hors ligne
#1510 Le 04/05/2007, à 17:02
- Antonio Silva
Re : [Clos] Centralisation Probleme Webcam+EasyCam
ID 043e:8585 LG Electronics USA, Inc. LPC-UC35 Webcam
Not supported.
Best regards and keep on the good work
#1511 Le 06/05/2007, à 20:47
- Pitxyoki
Re : [Clos] Centralisation Probleme Webcam+EasyCam
For all of you who are having trouble with this cam,
$ lsusb
ID 2770:9120 NHJ, Ltd Che-ez! Snap / iClick Tiny VGA Digital Camera
Me and some other users are making some progress on it, being reported on this post:
http://ubuntuforums.org/showthread.php?t=157427
Come and help if you can
______________________________________
~~~VERY, VERY bad French translation:~~~
Pour tout vous qui ont des problèmes avec ce cam,
$ lsusb
ID 2770:9120 NHJ, Ltd Che-ez! Snap / iClick Tiny VGA Digital Camera
Moi et des autres utilisateurs avons faite quelque progrès:
http://ubuntuforums.org/showthread.php?t=157427
Si vous sauvais, vous peut nous aider là
Pitxyoki
(You can contact me through ubuntuforums.org / vous pouvais me contacter sur ubuntuforums.org)
#1512 Le 06/05/2007, à 22:33
- iamalami
Re : [Clos] Centralisation Probleme Webcam+EasyCam
bonjour j un prob je veux installer win xp pro sur mon pc portable hp pavilion dv6211 et j'arrive pas
Hors ligne
#1513 Le 07/05/2007, à 10:10
- chicochoc
Re : [Clos] Centralisation Probleme Webcam+EasyCam
Logitec QuickCam détectée avec le logiciel Easycam 1.35
ID 046d:08f0 Logitech, Inc. QuickCam Messenger
Mais au bout du compte, même après un redémarrage du système Ubuntu 6, l'application Camorama n'arrive toujours pas à accéder à la webcam.
La webcam fonctionne sur la version 7 de Ubuntu mais pas le chargement des photos numériques.
Merci aux "GD" Gentils Développeurs
Ubuntu ... ensemble pour le Libre !
Partagez vos réussites ... elles en seront d'autant plus grande !
Mes expériences et solutions Ubuntu en ligne.
http://chicochoc.free.fr/
Hors ligne
#1514 Le 07/05/2007, à 11:15
- morganedesfees
Re : [Clos] Centralisation Probleme Webcam+EasyCam
j'avais une logitech QuickCam 5000 pro que j'ai fini par jeté
sous ubuntu 7.04 possédant easycam2 je pense acheter une autre webcam .. rapidement .. j'aimerai juste un conseil .;pour etre sur que celle si marche ..
je suis désespérée ..
merci d'avance de vos conseils..
#1515 Le 07/05/2007, à 12:39
- Pitxyoki
Re : [Clos] Centralisation Probleme Webcam+EasyCam
I have finally made it to get my
$ lsusb
ID 2770:9120 NHJ, Ltd Che-ez! Snap / iClick Tiny VGA Digital Camera
to work under Ubuntu 6.06.
I have posted an HOWTO here, for the interested:
http://ubuntuforums.org/showthread.php?t=435463
~~BAD French translation~~
Viens ici si vous avons une
$ lsusb
ID 2770:9120 NHJ, Ltd Che-ez! Snap / iClick Tiny VGA Digital Camera
J'ai faite une HOWTO là pour le mettre a fonctionner:
http://ubuntuforums.org/showthread.php?t=435463
#1516 Le 07/05/2007, à 19:34
- chicochoc
Re : [Clos] Centralisation Probleme Webcam+EasyCam
ERREUR AVEC EASYCAM 2
Je lance le programme EasyCam 2 sur Ubuntu 6.10
Ci-dessous le Log :
L'installation a échoué
Erreur lors de la commande Make Install
Ma Quickcam Messenger est bien détectée.
Qui a la solution
Dernière modification par chicochoc (Le 07/05/2007, à 19:34)
Ubuntu ... ensemble pour le Libre !
Partagez vos réussites ... elles en seront d'autant plus grande !
Mes expériences et solutions Ubuntu en ligne.
http://chicochoc.free.fr/
Hors ligne
#1517 Le 08/05/2007, à 19:13
- Jacquesvn
Re : [Clos] Centralisation Probleme Webcam+EasyCam
Hi there,
Please forward me the following text to one of following addresses :
ID 046d:08f6 Logitech, Inc.
Excuse my english, hope u can assist got ran easycam and was asked to forwardthe information as u can see. My French is terrible so I will try and use google to try and translate the forum all 600 odd pages :-) to see if I can come up with a solution to installing my webcam.
#1518 Le 09/05/2007, à 09:06
- Foussa
Re : [Clos] Centralisation Probleme Webcam+EasyCam
Bonjour,
j'ai une webcam intégré sur un ordinateur portable asus A6J.
elle ne fonctionne pas,
j'ai essayé d'installer camorama, et, lorsque je le lance, il me répond
"could not connect to video device (/dev/video0)
please check connection"
j'ai aussi installer EasyCam2, mais il me met le meme genre d'erreur,
je suppose que ma webcam n'est pas reconnue,
comment puis-je faire pour qu'elle le soit ?
Hors ligne
#1519 Le 09/05/2007, à 11:07
- chicochoc
Re : [Clos] Centralisation Probleme Webcam+EasyCam
Camorama est une interface logiciel pour visualiser les images de la webcam.
Dans un premier temps, il faut connaitre le chipset de votre webcam intégrée.
aller dans > Système > Administration > Gestionnaire des périphériques > ... puis essayer de trouver le périphérique. Ou dans la documentation de votre ordinateur.
Lorsque vous avez le nom du chipset, recherchez sur le site du constructeur les pilotes ' windows ' ou Linux.
Après, il faut utiliser Ndiswrapper.
Aller sur le site http://chicochoc.free.fr/ pour y trouver la méthode d'installation de la Logitech Quickcam. Je pense que la méthode fonctionne pour les autres modèles !
Ubuntu ... ensemble pour le Libre !
Partagez vos réussites ... elles en seront d'autant plus grande !
Mes expériences et solutions Ubuntu en ligne.
http://chicochoc.free.fr/
Hors ligne
#1520 Le 19/05/2007, à 16:15
- jurgentj
Re : [Clos] Centralisation Probleme Webcam+EasyCam
Salut à tous!!
Je pense être au bon endroit pour ma petite question...
Après avoir épluché pas mal de post de différents forum je me mets quasiment à genoux devant vous tous oui oui
J'ai une caméra Typhoon Webshot 350 qui normalement utilise le driver Omnivision ov51x
Jusqu'à là aucun soucis, j'ai téléchargé ce driver sous la forme d'une archive tar.bz2 sauf que lorsque je le compile une série d'erreurs apparaissent :
root@jurgen:~# cd /usr/src root@jurgen:/usr/src# tar jxvf /home/jurgen/Desktop/ov51x-1.65-1.11-mark.tar.bz2 ov51x-1.65-1.11-mark/ ov51x-1.65-1.11-mark/doc/ ov51x-1.65-1.11-mark/doc/kernel_install.html ov51x-1.65-1.11-mark/doc/apps.html ov51x-1.65-1.11-mark/doc/ov51x.pdf ov51x-1.65-1.11-mark/doc/ov51x.txt ov51x-1.65-1.11-mark/doc/install.html ov51x-1.65-1.11-mark/doc/v4l_api.html ov51x-1.65-1.11-mark/test/ ov51x-1.65-1.11-mark/test/Makefile ov51x-1.65-1.11-mark/test/getjpeg.c ov51x-1.65-1.11-mark/Makefile ov51x-1.65-1.11-mark/README ov51x-1.65-1.11-mark/ov511_decomp.c ov51x-1.65-1.11-mark/CHANGELOG ov51x-1.65-1.11-mark/ov51x.c ov51x-1.65-1.11-mark/ov51x.h ov51x-1.65-1.11-mark/COPYING ov51x-1.65-1.11-mark/ov518_decomp.c root@jurgen:/usr/src# cd /usr/src/ov51x-1.65-1.11-mark/ root@jurgen:/usr/src/ov51x-1.65-1.11-mark# make make -C /lib/modules/2.6.20-15-generic/build M=/usr/src/ov51x-1.65-1.11-mark modules make[1]: entrant dans le répertoire « /usr/src/linux-headers-2.6.20-15-generic » CC [M] /usr/src/ov51x-1.65-1.11-mark/ov51x.o /usr/src/ov51x-1.65-1.11-mark/ov51x.c:42:26: erreur: linux/config.h : Aucun fichier ou répertoire de ce type /usr/src/ov51x-1.65-1.11-mark/ov51x.c:207: erreur: expected ‘)’ before string constant /usr/src/ov51x-1.65-1.11-mark/ov51x.c:209: erreur: expected ‘)’ before string constant /usr/src/ov51x-1.65-1.11-mark/ov51x.c:211: erreur: expected ‘)’ before string constant /usr/src/ov51x-1.65-1.11-mark/ov51x.c:213: erreur: expected ‘)’ before string constant /usr/src/ov51x-1.65-1.11-mark/ov51x.c:216: erreur: expected ‘)’ before string constant /usr/src/ov51x-1.65-1.11-mark/ov51x.c:220: erreur: expected ‘)’ before string constant /usr/src/ov51x-1.65-1.11-mark/ov51x.c:223: erreur: expected ‘)’ before string constant /usr/src/ov51x-1.65-1.11-mark/ov51x.c:227: erreur: expected ‘)’ before string constant /usr/src/ov51x-1.65-1.11-mark/ov51x.c:229: erreur: expected ‘)’ before string constant /usr/src/ov51x-1.65-1.11-mark/ov51x.c:231: erreur: expected ‘)’ before string constant /usr/src/ov51x-1.65-1.11-mark/ov51x.c:234: erreur: expected ‘)’ before string constant /usr/src/ov51x-1.65-1.11-mark/ov51x.c:236: erreur: expected ‘)’ before string constant /usr/src/ov51x-1.65-1.11-mark/ov51x.c:239: erreur: expected ‘)’ before string constant /usr/src/ov51x-1.65-1.11-mark/ov51x.c:242: erreur: expected ‘)’ before string constant /usr/src/ov51x-1.65-1.11-mark/ov51x.c:244: erreur: expected ‘)’ before string constant /usr/src/ov51x-1.65-1.11-mark/ov51x.c:246: erreur: expected ‘)’ before string constant /usr/src/ov51x-1.65-1.11-mark/ov51x.c:248: erreur: expected ‘)’ before string constant /usr/src/ov51x-1.65-1.11-mark/ov51x.c:250: erreur: expected ‘)’ before string constant /usr/src/ov51x-1.65-1.11-mark/ov51x.c:252: erreur: expected ‘)’ before string constant /usr/src/ov51x-1.65-1.11-mark/ov51x.c:254: erreur: expected ‘)’ before string constant /usr/src/ov51x-1.65-1.11-mark/ov51x.c:256: erreur: expected ‘)’ before string constant /usr/src/ov51x-1.65-1.11-mark/ov51x.c:258: erreur: expected ‘)’ before string constant /usr/src/ov51x-1.65-1.11-mark/ov51x.c:260: erreur: expected ‘)’ before string constant /usr/src/ov51x-1.65-1.11-mark/ov51x.c:262: erreur: expected ‘)’ before string constant /usr/src/ov51x-1.65-1.11-mark/ov51x.c:264: erreur: expected ‘)’ before string constant /usr/src/ov51x-1.65-1.11-mark/ov51x.c:267: erreur: expected ‘)’ before string constant /usr/src/ov51x-1.65-1.11-mark/ov51x.c:270: erreur: expected ‘)’ before string constant /usr/src/ov51x-1.65-1.11-mark/ov51x.c:272: erreur: expected ‘)’ before string constant /usr/src/ov51x-1.65-1.11-mark/ov51x.c:274: erreur: expected ‘)’ before string constant /usr/src/ov51x-1.65-1.11-mark/ov51x.c:276: erreur: expected ‘)’ before string constant /usr/src/ov51x-1.65-1.11-mark/ov51x.c:278: erreur: expected ‘)’ before string constant /usr/src/ov51x-1.65-1.11-mark/ov51x.c:280: erreur: expected ‘)’ before string constant /usr/src/ov51x-1.65-1.11-mark/ov51x.c:282: erreur: expected ‘)’ before string constant /usr/src/ov51x-1.65-1.11-mark/ov51x.c:285: erreur: expected ‘)’ before string constant /usr/src/ov51x-1.65-1.11-mark/ov51x.c:288: erreur: expected ‘)’ before string constant /usr/src/ov51x-1.65-1.11-mark/ov51x.c:290: erreur: expected ‘)’ before string constant /usr/src/ov51x-1.65-1.11-mark/ov51x.c:292: erreur: expected ‘)’ before string constant /usr/src/ov51x-1.65-1.11-mark/ov51x.c:294: erreur: expected ‘)’ before string constant /usr/src/ov51x-1.65-1.11-mark/ov51x.c: In function ‘ov51x_init_isoc’: /usr/src/ov51x-1.65-1.11-mark/ov51x.c:5421: attention : assignment from incompatible pointer type /usr/src/ov51x-1.65-1.11-mark/ov51x.c: In function ‘ov51x_v4l1_open’: /usr/src/ov51x-1.65-1.11-mark/ov51x.c:5679: attention : implicit declaration of function ‘video_devdata’ /usr/src/ov51x-1.65-1.11-mark/ov51x.c:5679: attention : initialization makes pointer from integer without a cast /usr/src/ov51x-1.65-1.11-mark/ov51x.c:5681: attention : implicit declaration of function ‘video_get_drvdata’ /usr/src/ov51x-1.65-1.11-mark/ov51x.c:5681: attention : initialization makes pointer from integer without a cast /usr/src/ov51x-1.65-1.11-mark/ov51x.c: In function ‘ov51x_v4l1_close’: /usr/src/ov51x-1.65-1.11-mark/ov51x.c:5758: attention : initialization makes pointer from integer without a cast /usr/src/ov51x-1.65-1.11-mark/ov51x.c: In function ‘ov51x_v4l1_ioctl_internal’: /usr/src/ov51x-1.65-1.11-mark/ov51x.c:5816: attention : initialization makes pointer from integer without a cast /usr/src/ov51x-1.65-1.11-mark/ov51x.c:6220: erreur: déréférencement d'un pointeur de type incomplet /usr/src/ov51x-1.65-1.11-mark/ov51x.c: In function ‘ov51x_v4l1_ioctl’: /usr/src/ov51x-1.65-1.11-mark/ov51x.c:6332: attention : initialization makes pointer from integer without a cast /usr/src/ov51x-1.65-1.11-mark/ov51x.c:6338: attention : implicit declaration of function ‘video_usercopy’ /usr/src/ov51x-1.65-1.11-mark/ov51x.c: In function ‘ov51x_v4l1_read’: /usr/src/ov51x-1.65-1.11-mark/ov51x.c:6358: attention : initialization makes pointer from integer without a cast /usr/src/ov51x-1.65-1.11-mark/ov51x.c: In function ‘ov51x_v4l1_mmap’: /usr/src/ov51x-1.65-1.11-mark/ov51x.c:6528: attention : initialization makes pointer from integer without a cast /usr/src/ov51x-1.65-1.11-mark/ov51x.c:6548: attention : implicit declaration of function ‘remap_page_range’ /usr/src/ov51x-1.65-1.11-mark/ov51x.c: Hors de toute fonction : /usr/src/ov51x-1.65-1.11-mark/ov51x.c:6595: erreur: variable ‘vdev_template’ has initializer but incomplete type /usr/src/ov51x-1.65-1.11-mark/ov51x.c:6596: erreur: unknown field ‘owner’ specified in initializer /usr/src/ov51x-1.65-1.11-mark/ov51x.c:6596: attention : éléments en excès dans l'initialisation de la structure /usr/src/ov51x-1.65-1.11-mark/ov51x.c:6596: attention : (near initialization for ‘vdev_template’) /usr/src/ov51x-1.65-1.11-mark/ov51x.c:6597: erreur: unknown field ‘name’ specified in initializer /usr/src/ov51x-1.65-1.11-mark/ov51x.c:6597: attention : éléments en excès dans l'initialisation de la structure /usr/src/ov51x-1.65-1.11-mark/ov51x.c:6597: attention : (near initialization for ‘vdev_template’) /usr/src/ov51x-1.65-1.11-mark/ov51x.c:6598: erreur: unknown field ‘type’ specified in initializer /usr/src/ov51x-1.65-1.11-mark/ov51x.c:6598: attention : éléments en excès dans l'initialisation de la structure /usr/src/ov51x-1.65-1.11-mark/ov51x.c:6598: attention : (near initialization for ‘vdev_template’) /usr/src/ov51x-1.65-1.11-mark/ov51x.c:6599: erreur: unknown field ‘hardware’ specified in initializer /usr/src/ov51x-1.65-1.11-mark/ov51x.c:6599: attention : éléments en excès dans l'initialisation de la structure /usr/src/ov51x-1.65-1.11-mark/ov51x.c:6599: attention : (near initialization for ‘vdev_template’) /usr/src/ov51x-1.65-1.11-mark/ov51x.c:6600: erreur: unknown field ‘fops’ specified in initializer /usr/src/ov51x-1.65-1.11-mark/ov51x.c:6600: attention : éléments en excès dans l'initialisation de la structure /usr/src/ov51x-1.65-1.11-mark/ov51x.c:6600: attention : (near initialization for ‘vdev_template’) /usr/src/ov51x-1.65-1.11-mark/ov51x.c:6602: erreur: unknown field ‘release’ specified in initializer /usr/src/ov51x-1.65-1.11-mark/ov51x.c:6602: erreur: ‘video_device_release’ undeclared here (not in a function) /usr/src/ov51x-1.65-1.11-mark/ov51x.c:6602: attention : éléments en excès dans l'initialisation de la structure /usr/src/ov51x-1.65-1.11-mark/ov51x.c:6602: attention : (near initialization for ‘vdev_template’) /usr/src/ov51x-1.65-1.11-mark/ov51x.c:6604: erreur: unknown field ‘minor’ specified in initializer /usr/src/ov51x-1.65-1.11-mark/ov51x.c:6604: attention : éléments en excès dans l'initialisation de la structure /usr/src/ov51x-1.65-1.11-mark/ov51x.c:6604: attention : (near initialization for ‘vdev_template’) /usr/src/ov51x-1.65-1.11-mark/ov51x.c: In function ‘ov51x_probe’: /usr/src/ov51x-1.65-1.11-mark/ov51x.c:8248: attention : implicit declaration of function ‘video_device_alloc’ /usr/src/ov51x-1.65-1.11-mark/ov51x.c:8248: attention : assignment makes pointer from integer without a cast /usr/src/ov51x-1.65-1.11-mark/ov51x.c:8252: erreur: déréférencement d'un pointeur de type incomplet /usr/src/ov51x-1.65-1.11-mark/ov51x.c:8252: erreur: déréférencement d'un pointeur de type incomplet /usr/src/ov51x-1.65-1.11-mark/ov51x.c:8252: erreur: déréférencement d'un pointeur de type incomplet /usr/src/ov51x-1.65-1.11-mark/ov51x.c:8254: erreur: déréférencement d'un pointeur de type incomplet /usr/src/ov51x-1.65-1.11-mark/ov51x.c:8256: attention : implicit declaration of function ‘video_set_drvdata’ /usr/src/ov51x-1.65-1.11-mark/ov51x.c:8264: attention : implicit declaration of function ‘video_register_device’ /usr/src/ov51x-1.65-1.11-mark/ov51x.c:8264: erreur: ‘VFL_TYPE_GRABBER’ undeclared (first use in this function) /usr/src/ov51x-1.65-1.11-mark/ov51x.c:8264: erreur: (Each undeclared identifier is reported only once /usr/src/ov51x-1.65-1.11-mark/ov51x.c:8264: erreur: for each function it appears in.) /usr/src/ov51x-1.65-1.11-mark/ov51x.c:8271: erreur: déréférencement d'un pointeur de type incomplet /usr/src/ov51x-1.65-1.11-mark/ov51x.c:8281: erreur: déréférencement d'un pointeur de type incomplet /usr/src/ov51x-1.65-1.11-mark/ov51x.c:8304: erreur: déréférencement d'un pointeur de type incomplet /usr/src/ov51x-1.65-1.11-mark/ov51x.c:8305: attention : implicit declaration of function ‘video_device_release’ /usr/src/ov51x-1.65-1.11-mark/ov51x.c:8307: attention : implicit declaration of function ‘video_unregister_device’ /usr/src/ov51x-1.65-1.11-mark/ov51x.c: Hors de toute fonction : /usr/src/ov51x-1.65-1.11-mark/ov51x.c:8416: erreur: unknown field ‘owner’ specified in initializer /usr/src/ov51x-1.65-1.11-mark/ov51x.c:8416: attention : initialization from incompatible pointer type make[2]: *** [/usr/src/ov51x-1.65-1.11-mark/ov51x.o] Erreur 1 make[1]: *** [_module_/usr/src/ov51x-1.65-1.11-mark] Erreur 2 make[1]: quittant le répertoire « /usr/src/linux-headers-2.6.20-15-generic » make: *** [all] Erreur 2 root@jurgen:/usr/src/ov51x-1.65-1.11-mark#
J'ai suivi les instructions du fichier README qui disait que si on trouvait des erreurs il fallait modifier le fichier makefile et mettre INCLUDEDIR /usr/include
Rien n'y fait. Comment faire? Merci par avance, je suis sous feisty (Kubuntu)
Merci d'avance et bonne soirée!!
Hors ligne
#1521 Le 20/05/2007, à 19:19
- benoitdurel
Re : [Clos] Centralisation Probleme Webcam+EasyCam
Bonour à tous ,
j avoue que je n'ai pas lu les 62 pages du topic mais de toutes façons mon problème est bien moins avancé vu que je n'arrive meme pas à telecharger easycam2 .
Je suis sous feisty 64 bit et voila mon message d'erreur : Impossible de récupérer http://blognux.free.fr/debian/dists/unstable/main/binary-amd64/Packages.gz 404 Not Found.
Est ce que le programme à disparu ?
merci de votre aide
Hors ligne
#1522 Le 20/05/2007, à 19:45
- did
Re : [Clos] Centralisation Probleme Webcam+EasyCam
Salut,
Visiblement la section binary-amd64 n'existe pas sur ce dépôt (voir là), je ne sais pas si elle a existé un jour.
De toutes façon, ça fait longtemps que ce programme n'est plus maintenu.
A+
Hors ligne
#1523 Le 27/05/2007, à 19:04
- tyzeur
Re : [Clos] Centralisation Probleme Webcam+EasyCam
bonjour a tous
jaurai besoin d'aide parce que j'ai une webcam labtec.
elle marche mais je peux pas la configurer jme sui un peux renseigné est j'ai apris que je devais installer pwcx mai je ses pas du tout comment on fais.sa fait que depuis 3 4 jours que jutilise linux donc si on pouvai m'aider se serai sympa
jutilise ubuntu Feisty Fawn
merci d'avance
tyzeur
Hors ligne
#1524 Le 28/05/2007, à 13:28
- tyzeur
Re : [Clos] Centralisation Probleme Webcam+EasyCam
ptite préssition j'ai lu les page precedente mais je comprent pas
jsui novice
Hors ligne
#1525 Le 28/05/2007, à 13:58
- Kanor
Re : [Clos] Centralisation Probleme Webcam+EasyCam
Salut dans la communauté des linuxiens
Est ce que tu peut taper dans le terminal (que tu peut trouver dans application accessoire ) lsusb et coller se que tu obtient ici ?
N'oublie pas de brancher ta webcam avant de faire la commande .
Cette commande permet d'obtenir un numéros qui identifie ton matériel c'est plus précis que le nom du produit .
Avec ce numéros il sera facile de trouver le driver correspondant en regardant sur google sur la doc d'ubuntu ....;)
Hors ligne